C19HF15

Reaction thermochemistry data

Data compiled by: John E. Bartmess

Individual Reactions

C19F15- + Hydrogen cation = C19HF15

By formula: C19F15- + H+ = C19HF15

Quantity Value Units Method Reference Comment
Δr1362. ± 9.2kJ/molG+TSKoppel, Taft, et al., 1994gas phase
Quantity Value Units Method Reference Comment
Δr1329. ± 8.4kJ/molIMREKoppel, Taft, et al., 1994gas phase

Gas phase ion energetics data

Data compiled by: John E. Bartmess

De-protonation reactions

C19F15- + Hydrogen cation = C19HF15

By formula: C19F15- + H+ = C19HF15

Quantity Value Units Method Reference Comment
Δr1362. ± 9.2kJ/molG+TSKoppel, Taft, et al., 1994gas phase
Quantity Value Units Method Reference Comment
Δr1329. ± 8.4kJ/molIMREKoppel, Taft, et al., 1994gas phase

References

Koppel, Taft, et al., 1994
Koppel, I.A.; Taft, R.W.; Anvia, F.; Zhu, S.Z.; Hu, L.Q.; Sung, K.S.; Desmarteau, D.D.; Yagupolskii, L.M., The Gas-Phase Acidities of Very Strong Neutral Bronsted Acids, J. Am. Chem. Soc., 1994, 116, 7, 3047, https://doi.org/10.1021/ja00086a038 . [all data]