Campesterol

Kovats' RI, non-polar column, isothermal

Data compiled by: NIST Mass Spectrometry Data Center, William E. Wallace, director

Column type PackedPackedPackedPackedPacked
Active phase SE-30SE-30SE-30E-301E-301
Column length (m) 1.21.21.21.21.2
Carrier gas N2N2N2N2N2
Substrate
Column diameter (mm)
Phase thickness (μm)
Temperature (C) 230.240.250.210.220.
I 3116.3131.3147.3105.3099.
ReferenceKeiser, Retunskii, et al., 1990Keiser, Retunskii, et al., 1990Keiser, Retunskii, et al., 1990Keiser, Retunskii, et al., 1990Keiser, Retunskii, et al., 1990
Comment MSDC-RI MSDC-RI MSDC-RI MSDC-RI MSDC-RI
Column type PackedPackedPackedPackedPacked
Active phase E-301E-301E-301E-301SE-30
Column length (m) 1.21.21.21.21.2
Carrier gas N2N2N2N2N2
Substrate
Column diameter (mm)
Phase thickness (μm)
Temperature (C) 220.230.230.240.230.
I 3138.3114.3150.3146.3116.
ReferenceKeiser, Retunskii, et al., 1990Keiser, Retunskii, et al., 1990Keiser, Retunskii, et al., 1990Keiser, Retunskii, et al., 1990Keiser, Yazlovetsky, et al., 1986
Comment MSDC-RI MSDC-RI MSDC-RI MSDC-RI MSDC-RI
Column type PackedPackedPackedPackedPacked
Active phase SE-30SE-30SE-30SE-30SE-30
Column length (m) 1.21.21.21.21.2
Carrier gas N2N2N2N2N2
Substrate
Column diameter (mm)
Phase thickness (μm)
Temperature (C) 240.250.240.240.240.
I 3117.3135.3103.3103.3112.
ReferenceKeiser, Yazlovetsky, et al., 1986Keiser, Yazlovetsky, et al., 1986Keiser, Yazlovetsky, et al., 1986Keiser, Yazlovetsky, et al., 1986Keiser, Yazlovetsky, et al., 1986
Comment MSDC-RI MSDC-RI MSDC-RI MSDC-RI MSDC-RI

References

Keiser, Retunskii, et al., 1990
Keiser, L.S.; Retunskii, V.N.; Yazlovetskii, I.G., Gas chromatographic identification of sterols in insects. Estimation of retention data reproducibility, Zh. Anal. Khim., 1990, 45, 1767-1773. [all data]

Keiser, Yazlovetsky, et al., 1986
Keiser, L.S.; Yazlovetsky, I.G.; Retunsky, V.N., Gas-chromatographic indentification of sterols in insects with the use of two-dimentional three-phase diagrams plotted on the basis of logarithmic retention indices, J. Anal. Chem. USSR (Engl. Transl.), 1986, 41, 9, 1166-1172. [all data]