Pinic acid dimethyl ester

Condensed phase thermochemistry data

Data compiled by: Hussein Y. Afeefy, Joel F. Liebman, and Stephen E. Stein

Quantity Value Units Method Reference Comment
Δcliquid-1441.6kcal/molCcbRoth and Ostling, 1913Corresponding Δfliquid = -207.8 kcal/mol (simple calculation by NIST; no Washburn corrections)

References

Roth and Ostling, 1913
Roth, W.A.; Ostling, G.J., Thermochemische Untersuchungen in der alicyclischen Reihe, Ber., 1913, 46, 309-327. [all data]