2-Naphthalenemethanol, 1,2,3,4,4a,5,6,8a-octahydro-α,α,4a,8-tetramethyl-, [2R-(2α,4aα,8aβ)]-

Normal alkane RI, non-polar column, temperature ramp

Data compiled by: NIST Mass Spectrometry Data Center, William E. Wallace, director

Column type CapillaryCapillaryCapillaryCapillaryCapillary
Active phase HP-5 MSHP-5 MSRTX-1HP-5DB-5
Column length (m) 60.30.60.30.30.
Carrier gas HeliumHeliumHeliumHeliumHelium
Substrate
Column diameter (mm) 0.250.250.220.2520.25
Phase thickness (μm) 0.250.250.250.250.25
Tstart (C) 40.50.60.60.50.
Tend (C) 250.180.230.240.250.
Heat rate (K/min) 3.2.2.3.2.
Initial hold (min) 1.
Final hold (min) 20. 45.
I 1656.1653.1629.1650.1654.
ReferenceSardashti, Valizadeh, et al., 2013Phungpanya, Thongpoon, et al., 2012Yapi, Boti, et al., 2012Cavar, Maksimovic, et al., 2010Ho, Wang, et al., 2010
Comment MSDC-RI MSDC-RI MSDC-RI MSDC-RI MSDC-RI
Column type CapillaryCapillaryCapillaryCapillaryCapillary
Active phase HP-5 MSCP-Sil 5 CBDB-5HP-55 % Phenyl methyl siloxane
Column length (m) 30.30.30.25.60.
Carrier gas HeliumNitrogenHeliumHeliumHelium
Substrate
Column diameter (mm) 0.250.250.250.200.25
Phase thickness (μm) 0.250.250.250.330.25
Tstart (C) 70.50.50.60.90.
Tend (C) 290.200.250.240.225.
Heat rate (K/min) 5.5.5.3.3.
Initial hold (min)   2.
Final hold (min) 10.  7.3.
I 1659.1673.1654.1656.1655.
ReferenceRadulovic, Blagojevic, et al., 2010Hnawia, Menut, et al., 2009Ho, Wang, et al., 2009Maridass, 2009Retta, Gattuso, et al., 2009
Comment MSDC-RI MSDC-RI MSDC-RI MSDC-RI MSDC-RI
Column type CapillaryCapillaryCapillaryCapillaryCapillary
Active phase HP-5 MSHP-5 MSCP Sil 5 CBHP-5MSHP-5
Column length (m) 30.30.30.30.30.
Carrier gas HeliumHeliumN2HeHelium
Substrate
Column diameter (mm) 0.250.250.320.250.25
Phase thickness (μm) 0.250.250.250.250.26
Tstart (C) 50.50.60.50.60.
Tend (C) 280.230.300.280.240.
Heat rate (K/min) 4.3.4.5.4.
Initial hold (min)  10. 4.2.
Final hold (min)  10. 10.20.
I 1656.1652.1649.1656.1657.
ReferenceZhao, Zeng, et al., 2009Adams, Beauchamp, et al., 2007Baran, von Reuss, et al., 2007Cho, Abd El-Aty, et al., 2007Farsam, Amanlou, et al., 2007
Comment MSDC-RI MSDC-RI MSDC-RI MSDC-RI MSDC-RI
Column type CapillaryCapillaryCapillaryCapillaryCapillary
Active phase HP-101DB-5Methyl SiliconeDB-1DB-5
Column length (m) 25.30.50.50.30.
Carrier gas HeHeliumHeliumHeHe
Substrate
Column diameter (mm) 0.20.250.250.250.25
Phase thickness (μm) 0.20.25 0.250.25
Tstart (C) 70.60.50.95.50.
Tend (C) 200.220.240.240.265.
Heat rate (K/min) 3.4.3.4.2.5
Initial hold (min) 2.   1.
Final hold (min)     20.
I 1612.1654.1671.1643.1659.
ReferenceJerkovic, Mastelic, et al., 2007Morteza-Semnani, Saeedi, et al., 2007Ozcan and Chalchat, 2007Pala-Paul, Brophy, et al., 2007Bazargani, Almasirad, et al., 2006
Comment MSDC-RI MSDC-RI MSDC-RI MSDC-RI MSDC-RI
Column type CapillaryCapillaryCapillaryCapillaryCapillary
Active phase AT-5BP-1HP-5DB-5DB-5
Column length (m) 60.50.30.30.30.
Carrier gas He He Helium
Substrate
Column diameter (mm) 0.250.220.320.250.25
Phase thickness (μm) 0.250.250.250.250.25
Tstart (C) 60.60.60.40.60.
Tend (C) 200.220.246.210.260.
Heat rate (K/min) 4.2.3.2.3.
Initial hold (min)    2.
Final hold (min) 20.20. 33.
I 1655.1644.1653.1655.1656.
ReferenceBorges, Rojas, et al., 2006Boti, Yao, et al., 2006Coronel, Cerda-Garcia-Rojas, et al., 2006Garneau F.X., Collin G., et al., 2006Javidnia, Miri, et al., 2006
Comment MSDC-RI MSDC-RI MSDC-RI MSDC-RI MSDC-RI
Column type CapillaryCapillaryCapillaryCapillaryCapillary
Active phase HP-5MSDB-1BP-1CP Sil 5 CBDB-5
Column length (m) 30.60.50.30.30.
Carrier gas He HeN2He
Substrate
Column diameter (mm) 0.250.250.220.320.25
Phase thickness (μm) 0.250.250.250.250.25
Tstart (C) 50.70.60.50.60.
Tend (C) 280.230.220.300.220.
Heat rate (K/min) 5.2.2.4.4.
Initial hold (min) 4.2.  5.
Final hold (min) 10.20.20.
I 1656.1638.1644.1631.1655.
ReferenceKim, Abd El-Aty, et al., 2006Lan Phi N.T., Nishiyama C., et al., 2006Lesueur, Ban, et al., 2006Lis and Milczarek, 2006Morteza-Semnani K., Saeedi M., et al., 2006
Comment MSDC-RI MSDC-RI MSDC-RI MSDC-RI MSDC-RI
Column type CapillaryCapillaryCapillaryCapillaryCapillary
Active phase PE-5DB-5HP-5MSDB-5HP-5
Column length (m) 50.30.30.30.25.
Carrier gas HeHydrogen N2H2
Substrate
Column diameter (mm) 0.320.250.250.250.32
Phase thickness (μm) 0.250.250.250.250.52
Tstart (C) 100.70.50.60.50.
Tend (C) 280.280.250.240.280.
Heat rate (K/min) 3.4.10.4.2.5
Initial hold (min) 1.4.5. 5.
Final hold (min)
I 1652.1652.1670.1652.1654.
ReferencePandey-Rai S., Mallavarapu G.R., et al., 2006Pino, Marbot, et al., 2006Robinson, 2006Trilles, Bombarda, et al., 2006Wang, Kong, et al., 2006
Comment MSDC-RI MSDC-RI MSDC-RI MSDC-RI MSDC-RI
Column type CapillaryCapillaryCapillaryCapillaryCapillary
Active phase HP-5DB-1HP-5DB-5HP-5MS
Column length (m) 30.25.25.30.30.
Carrier gas HeHeHeHeHe
Substrate
Column diameter (mm) 0.250.250.20.250.25
Phase thickness (μm) 0.250.250.330.250.25
Tstart (C) 60.50.60.60.60.
Tend (C) 250.250.240.300.200.
Heat rate (K/min) 10.3.3.3.4.
Initial hold (min) 2.3. 3.30.
Final hold (min) 10. 7.
I 1677.1658.1649.1652.1649.
ReferenceWang, Yang, et al., 2006Cégiéla-Carlioz, Bessière, et al., 2005Duarte, Figueira, et al., 2005Ferraz, Limberger, et al., 2005Gauvin and Smadja, 2005
Comment MSDC-RI MSDC-RI MSDC-RI MSDC-RI MSDC-RI
Column type CapillaryCapillaryCapillaryCapillaryCapillary
Active phase HP-5MSDB-5HP-5MSPE-5RTX-1
Column length (m) 25.30.30.30.60.
Carrier gas HeHeHeH2He
Substrate
Column diameter (mm) 0.250.250.250.320.25
Phase thickness (μm)  0.250.250.250.25
Tstart (C) 50.60.60.60.60.
Tend (C) 250.220.280.230.250.
Heat rate (K/min) 3.4.4.5.5.
Initial hold (min) 3.4. 2.
Final hold (min) 10.  4.10.
I 1654.1653.1650.1658.1654.
ReferenceGhasemi Y., Faridi P., et al., 2005Morteza-Semnani and Saeedi, 2005Sajjadi, 2005Singh, Raina, et al., 2005Sonboli A., Fakhari A.R., et al., 2005
Comment MSDC-RI MSDC-RI MSDC-RI MSDC-RI MSDC-RI
Column type CapillaryCapillaryCapillaryCapillaryCapillary
Active phase RTX-1CP Sil 8 CBDB-5MSSPB-5DB-5
Column length (m) 60.30.30.60.30.
Carrier gas HeHeHeHeHe
Substrate
Column diameter (mm) 0.250.250.250.320.25
Phase thickness (μm) 0.25 0.251.0.25
Tstart (C) 60.60.80.60.60.
Tend (C) 25.290.250.200.300.
Heat rate (K/min) 5.3.5.4.3.
Initial hold (min)  5.2.
Final hold (min) 10. 9.30.
I 1647.1637.1664.1668.1616.
ReferenceSonboli, Salehi, et al., 2005Suárez, Vásquez, et al., 2005Watanabe Y., Mihara R., et al., 2005Gauvin, Ravaomanarivo, et al., 2004Lago, de Ávila, et al., 2004
Comment MSDC-RI MSDC-RI MSDC-RI MSDC-RI MSDC-RI
Column type CapillaryCapillaryCapillaryCapillaryCapillary
Active phase RTX-1DB-5DB-5HP-5MSDB-1
Column length (m) 30.30.30.30.30.
Carrier gas N2 HeHeN2
Substrate
Column diameter (mm) 0.320.250.250.250.25
Phase thickness (μm) 0.250.250.250.250.25
Tstart (C) 60.40.60.60.50.
Tend (C) 300.210.240.280.200.
Heat rate (K/min) 4.2.3.3.5.
Initial hold (min)  2.
Final hold (min)  33.
I 1648.1650.1650.1654.1643.
ReferenceLis, Boczek, et al., 2004Lopez Arze, Collin, et al., 2004Tellez, Khan, et al., 2004Couladis, Özcan, et al., 2003Fekam Boyom, Ngouana, et al., 2003
Comment MSDC-RI MSDC-RI MSDC-RI MSDC-RI MSDC-RI
Column type CapillaryCapillaryCapillaryCapillaryCapillary
Active phase RSL-200RSL-200DB-1HP-5DB-1
Column length (m) 30.30.60.30.60.
Carrier gas H2H2HeHeHe
Substrate
Column diameter (mm) 0.320.320.250.250.32
Phase thickness (μm) 0.250.250.250.320.25
Tstart (C) 40.40.50.60.50.
Tend (C) 280.280.250.250.200.
Heat rate (K/min) 6.6.4.5.3.
Initial hold (min) 5.5. 30.6.
Final hold (min) 5.5.
I 1649.1669.1636.1660.1644.
ReferenceJirovetz, Buchbauer, et al., 2003Jirovetz, Buchbauer, et al., 2003, 2Pourmortazavi, Sefidkon, et al., 2003Yassa, Akhani, et al., 2003Cimanga, Apers, et al., 2002
Comment MSDC-RI MSDC-RI MSDC-RI MSDC-RI MSDC-RI
Column type CapillaryCapillaryCapillaryCapillaryCapillary
Active phase DB-5HP-5DB-5DB-5MSDB-1
Column length (m) 30.30.30.30.50.
Carrier gas N2N2HeHeN2
Substrate
Column diameter (mm) 0.250.250.250.250.25
Phase thickness (μm) 0.250.250.250.250.25
Tstart (C) 50.50.60.60.60.
Tend (C) 250.250.240.240.240.
Heat rate (K/min) 4.4.3.3.3.
Initial hold (min)  5.
Final hold (min)
I 1652.1652.1653.1650.1623.
ReferenceFarah, Fechtal, et al., 2002Farah, Fechtal. M., et al., 2002Flamini, Ertugrul, et al., 2002Maia, Zoghbi, et al., 2002Velasco-Negueruela, Pérez-Alonso, et al., 2002
Comment MSDC-RI MSDC-RI MSDC-RI MSDC-RI MSDC-RI
Column type CapillaryCapillaryCapillaryCapillaryCapillary
Active phase DB-1BP-1DB-5MSDB-5DB-5
Column length (m) 60.30.30.30.60.
Carrier gas HeN2HeHeHe
Substrate
Column diameter (mm) 0.250.250.250.250.25
Phase thickness (μm) 0.250.250.250.25
Tstart (C) 40.60.60.60.50.
Tend (C) 280.220.240.270.250.
Heat rate (K/min) 4.5.3.3.3.
Initial hold (min) 5.   5.
Final hold (min)   30.
I 1639.1637.1630.1657.1652.
ReferenceDabiri and Sefidkon, 2001Gupta, Mallavarapu, et al., 2001Marongiu, Porcedda, et al., 2001Palmeira, Conserva, et al., 2001Rousis, Papadogianni, et al., 2001
Comment MSDC-RI MSDC-RI MSDC-RI MSDC-RI MSDC-RI
Column type CapillaryCapillaryCapillaryCapillaryCapillary
Active phase DB-1OV-101DB-5MSDB-5OV-101
Column length (m) 30.50.30.30.25.
Carrier gas HeN2HeHelium
Substrate
Column diameter (mm) 0.20.20.250.250.32
Phase thickness (μm)   0.250.25
Tstart (C) 60.80.60.60.50.
Tend (C) 240.200.240.240.200.
Heat rate (K/min) 3.1.3.3.5.
Initial hold (min)
Final hold (min)  20.
I 1649.51677.1650.1653.1648.
ReferenceSantos, Moreira, et al., 2001Menon, Chacko, et al., 1999Zoghbi, Andrade, et al., 1999Santos, Andrade, et al., 1998Zollo, Biyiti, et al., 1998
Comment MSDC-RI MSDC-RI MSDC-RI MSDC-RI MSDC-RI
Column type CapillaryCapillaryCapillaryCapillaryCapillary
Active phase DB-5DB-1DB-5HP-1OV-101
Column length (m) 30. 30.23.50.
Carrier gas He HeliumHeN2
Substrate
Column diameter (mm) 0.32 0.250.320.25
Phase thickness (μm)   0.250.170.17
Tstart (C) 60.80.60.60.50.
Tend (C) 250.220.240.250.220.
Heat rate (K/min) 3.6.3.5.5.
Initial hold (min)    3.
Final hold (min)    30.
I 1645.1634.1653.1625.1660.
ReferenceAbreu and Noronha, 1997Salgueiro, Vila, et al., 1997Tellez, Estell, et al., 1997Ayedoun, Adeoti, et al., 1996Chacko, Jayalekshmy, et al., 1996
Comment MSDC-RI MSDC-RI MSDC-RI MSDC-RI MSDC-RI

Normal alkane RI, non-polar column, custom temperature program

Data compiled by: NIST Mass Spectrometry Data Center, William E. Wallace, director

Column type CapillaryCapillaryCapillaryCapillaryCapillary
Active phase TR-5 MSTR-5 MSDB-1CBP-5CP Sil 8 CB
Column length (m) 15.15.30.30.30.
Carrier gas HeliumHeliumHydrogenHelium
Substrate
Column diameter (mm) 0.250.250.250.250.25
Phase thickness (μm) 0.250.250.250.250.25
Program 35 0C (3 min) 2 0C/min -> 60 0C (3 min) 2 0C/min -> 80 0C (3 min) 4 0C/min -> 120 0C (3 min) 5 0C/min -> 150 0C (3 min) 15 0C/min -> 240 0C (10 min)35 0C (3 min) 2 0C/min -> 60 0C (3 min) 2 0C/min -> 80 0C (3 min) 4 0C/min -> 120 0C (3 min) 5 0C/min -> 150 0C (3 mion) 15 0C/min -> 240 0C (10 min)45 0C 3 0C/min -> 175 0C 15 0C/min -> 300 0C (10 min)60 0C 3 0C/min -> 246 0C 10 0C/min -> 270 0C (5 min)60C => 2.5C/min => 170C => 10C/min => 250C (5min)
I 1643.1650.1634.1658.1652.
ReferenceKurashov, Mitrukova, et al., 2014Kurashov, Krylova, et al., 2013Albano, Lima, et al., 2012Fortes, Naves, et al., 2011Kristiawan, Sobolik, et al., 2008
Comment MSDC-RI MSDC-RI MSDC-RI MSDC-RI MSDC-RI
Column type CapillaryCapillaryCapillaryCapillaryCapillary
Active phase DB-5 MSRTX-5HP-5MSHP-5 MSDB-1
Column length (m) 30.30.30.30.30.
Carrier gas  HeliumHeHeliumHe
Substrate
Column diameter (mm) 0.250.250.250.250.25
Phase thickness (μm) 0.250.250.250.250.25
Program 80 0C (1.5 min) 4 pC/min -> 180 0C 10 0C/min -> 300 0C (10 min)60 0C (5 min) 5 0C/min -> 110 0C 3 0C/min -> 220 0C (5 min)40C(10min) => 3C/min => 200C => 2C/min => 220C40 0C (10 min) 3 0C/min -> 200 0C 2 0C/min -> 220 0C45C => 3C/min => 175C => 15C/min => 300C (10min)
I 1652.1603.1650.1653.1634.
ReferenceSilva, Doria, et al., 2008Zachariah, Leela, et al., 2008Cole, Haber, et al., 2007Eason and Setzer, 2007Ferreira, Meireles de Sousa, et al., 2007
Comment MSDC-RI MSDC-RI MSDC-RI MSDC-RI MSDC-RI
Column type CapillaryCapillaryCapillaryCapillaryCapillary
Active phase HP-1HP-5 MSDB-5CP Sil 8 CBHP-5 MS
Column length (m) 30.30.30.50.30.
Carrier gas HeHeliumHeHeHelium
Substrate
Column diameter (mm) 0.20.250.250.320.25
Phase thickness (μm) 0.33 0.250.250.25
Program 60C(5min) => 3C/min => 180C => 20C/min => 280C(10min)40 0C (10 min) 3 oC/min -> 200 0C 2 0C/min -> 220 0C40C (5min) => 2C/min => 250C(15min) => 5C/min => 270C (10min)60 0C (2 min) 5 0C/min -> 160 0C 10 0C/min -> 250 0C (5 min)40 0C (10 min) 3 0C/min -> 200 0C 2 0C/min -> 220 0C
I 1653.1653.1655.1652.1651.
ReferenceMerle, Verdeguer, et al., 2007Setzer, Stokes, et al., 2007Massardo, Senatore, et al., 2006Mockute, Bernotiene, et al., 2006Schmidt, Noletto, et al., 2006
Comment MSDC-RI MSDC-RI MSDC-RI MSDC-RI MSDC-RI
Column type CapillaryCapillaryCapillaryCapillaryCapillary
Active phase DB-5DB-5DB-5Methyl SiliconeOV-1
Column length (m) 30.30.30. 30.
Carrier gas HeHeHe He
Substrate
Column diameter (mm) 0.320.250.25 0.25
Phase thickness (μm) 0.250.250.25 0.25
Program 60C => 2C/min => 100C => 3C/min => 160C => 5C/min => 280C35C => 4C/min => 180C => 10C/min => 250C40C(1min) => 9C/min => 130C => 2C/min => 230Cnot specified45 0C (4 min) 3 0C/min -> 75 0C 4 0C/min -> 115 0C 6 0C/min -> 312 0C
I 1643.1651.1649.1654.1636.
ReferenceSrivastava, Mallavarapu, et al., 2006Cysne, Canuto, et al., 2005Hamm, Bleton, et al., 2005Couladis, Özcan, et al., 2004Hafez and Abdel-Salam, 2004
Comment MSDC-RI MSDC-RI MSDC-RI MSDC-RI MSDC-RI
Column type CapillaryCapillaryCapillaryCapillaryCapillary
Active phase BPX-5DB-1HP-5SE-30CP Sil 5 CB
Column length (m) 30.30.30. 25.
Carrier gas H2HeHe N2
Substrate
Column diameter (mm) 0.250.250.25
Phase thickness (μm) 0.250.250.25 0.39
Program 50 0C (1 min) 3 0C/min -> 150 0C 5 0C/min -> 250 0C (5 min)45C => 3C/min => 175C => 15C/min => 300C (10min)50C (3min) => 3C/min => 150C (10min) => 10C/min => 250Cnot specifiednot specified
I 1654.1634.1654.1643.1645.
ReferenceKoba, Sanda, et al., 2004Miguel, Simões, et al., 2004Tepe, Donmez, et al., 2004Vinogradov, 2004Weyerstahl, Marschall, et al., 2000
Comment MSDC-RI MSDC-RI MSDC-RI MSDC-RI MSDC-RI
Column type CapillaryCapillaryCapillaryCapillaryCapillary
Active phase CP Sil 5 CBCP Sil 5 CBDB-1CP Sil 5 CBPolydimethyl siloxanes
Column length (m) 25.25.30.25.
Carrier gas  HeH2N2
Substrate
Column diameter (mm)   0.25
Phase thickness (μm)  0.390.25
Program not specifiednot specified45C => 3C/min => 175C => 15C => 240C(10min)not specifiednot specified
I 1643.1648.1634.1640.1643.
ReferenceWeyerstahl, Marschall, et al., 2000, 2Weyerstahl, Marschall, et al., 1999da Silva, Figueiredo, et al., 1998Weyerstahl, Marschall, et al., 1997Zenkevich, 1997
Comment MSDC-RI MSDC-RI MSDC-RI MSDC-RI MSDC-RI

References

Sardashti, Valizadeh, et al., 2013
Sardashti, A.R.; Valizadeh, J.; Adhami, Y., Variations in the essential oil composition of Peroskia abrotonolides of different growth stage in Baluchestan, Middle-East J. Sci. Res., 2013, 13, 6, 781-784. [all data]

Phungpanya, Thongpoon, et al., 2012
Phungpanya, C.; Thongpoon, C.; Pripdeevech, P.; Machan, T., Analysis of aroma volatiles from fresh leaves of Plectranthus amboinicus using solid phase microextraction (SPME) technique, Pure and Applied Chemistry International Conference 2012 (PACCON 2012), 2012, 16701672. [all data]

Yapi, Boti, et al., 2012
Yapi, T.A.; Boti, J.B.; Attioua, B.K.; Ahibo, A.C.; Bighelli, A.; Casanova, J.; Tomi, F., Three new natural compounds from the root bark essential oil from Xylopia aethiopica, Phytochem. Anal., 2012, 1-6. [all data]

Cavar, Maksimovic, et al., 2010
Cavar, S.; Maksimovic, M.; Solic, M.E., Comparison of essential oil composition of Stachys menthufolia Vis. from two natural habitas in Croatia, Biologica Nyssana, 2010, 1, 1-2, 99-103. [all data]

Ho, Wang, et al., 2010
Ho, C.-L.; Wang, E.I.-C.; Yu, H.-T.; Yu, H.-M.; Su, Y.-C., Composition amd antioxidant activities of essential oils of different tissues from Cryptomeria japonica D. Don, Quarterly J. Chin. Forestry, 2010, 32, 1, 63-76. [all data]

Radulovic, Blagojevic, et al., 2010
Radulovic, N.; Blagojevic, P.; Palic, R., Comparative study of the leaf volatiles of Arctostaphylos uva-ursi (L.) Spreng. and Vaccinium vitis-idaea L. (Ericaceae), Molecules, 2010, 15, 9, 6168-6185, https://doi.org/10.3390/molecules15096168 . [all data]

Hnawia, Menut, et al., 2009
Hnawia, E.; Menut, C.; Agrebi, A.; Cabalion, P., Wood essential oil of two endemic trees from New Caledonia: Callitris sulcata (Parl.) Schltr. and Callitris neocaledonica Dummer, Biochem. Systematics Ecol., 2009, 36, 11, 859-866, https://doi.org/10.1016/j.bse.2008.08.007 . [all data]

Ho, Wang, et al., 2009
Ho, C.-L.; Wang, E.I.-C.; Su, Y.-C., Essential oil compositions and bioactivities of the various parts of Cinnamomum camphora Sieb. var. linallolifera Fujuta, Journal title only in Chinese, 2009, 31, 2, 77-96. [all data]

Maridass, 2009
Maridass, M., Inter-generic relationships of Ocimum and Origanum based on GC-MS volatile oils data using software NTSPSpc version 2.0, Ethnobotanical Leaflets, 2009, 13, 83-88. [all data]

Retta, Gattuso, et al., 2009
Retta, D.; Gattuso, M.; Gattuso, S.; Lira, P. Di Leo; van Baren, C.; Ferraro, G.; Bandoni A., Essential oil composition of Achyrocline flaccida (Weinm.) DC. (Asteraceae) from different locations of Argentina, Biochem. Systematics Ecol., 2009, 36, 12, 877-881, https://doi.org/10.1016/j.bse.2008.11.001 . [all data]

Zhao, Zeng, et al., 2009
Zhao, C.; Zeng, Y.; Wan, M.; Li, R.; Liang, Y.; Li, C.; Zeng, Z.; Chau, F.-T., Comparative analysis of essential oils from eight herbal medicines with pungent flavor and cool nature by GC-MS and chemometric resolution methods, J. Sep. Sci., 2009, 32, 4, 660-670, https://doi.org/10.1002/jssc.200800484 . [all data]

Adams, Beauchamp, et al., 2007
Adams, R.P.; Beauchamp, P.S.; Dev, V.; Dutz, S.M., New Natural Products Isolated from One-Seeded Juniperus of the Southwestern United States: Isolation and Occurence of 2-Ethenyl-3-methyl Phanol and Its Derivatives, J. Essent. Oil Res., 2007, 19, 2, 146-152, https://doi.org/10.1080/10412905.2007.9699247 . [all data]

Baran, von Reuss, et al., 2007
Baran, S.; von Reuss, S.H.; König, W.A.; Kalemba, D., Composition of the essential oil of Abies koreana Wils., Flavour Fragr. J., 2007, 22, 1, 78-83, https://doi.org/10.1002/ffj.1762 . [all data]

Cho, Abd El-Aty, et al., 2007
Cho, S.-K.; Abd El-Aty, A.M.; Choi, J.-H.; Kim, M.R.; Shim, J.H., Optimized conditions for the extraction of secondary volatile metabolites in Angelica roots by accelerated solvent extraction, J. Pharm. Biomed. Anal., 2007, 44, 5, 1154-1158, https://doi.org/10.1016/j.jpba.2007.03.011 . [all data]

Farsam, Amanlou, et al., 2007
Farsam, H.; Amanlou, M.; Taghi-Cheetsaz, N.; Amin, G.R.; Saledi-Sormaghi, M.H., Essential Oil of Chimonanthus fragrans flowers Population of Tehran, DARU, 2007, 15, 3, 129-131. [all data]

Jerkovic, Mastelic, et al., 2007
Jerkovic, I.; Mastelic, J.; Marijanovic, Z., Bound volatile compounds and essential oil from the fruit of Maclura pomifera (Raf.) Schneid. (osage orange), Flavour Fragr. J., 2007, 22, 1, 84-88, https://doi.org/10.1002/ffj.1763 . [all data]

Morteza-Semnani, Saeedi, et al., 2007
Morteza-Semnani, K.; Saeedi, M.; Akbarzadeh, M., Essential oil composition of Teucrium scordium L., Acta Pharm., 2007, 57, 4, 499-504, https://doi.org/10.2478/v10007-007-0040-6 . [all data]

Ozcan and Chalchat, 2007
Ozcan, M.M.; Chalchat, J.C., Chemical Composition od Carrot Seeds (Daucus carota L.) Cultivated in Turkey: Characterization of the Seed Oil and Essential Oil, Grasas y Aceites, 2007, 58, 4, 359-365. [all data]

Pala-Paul, Brophy, et al., 2007
Pala-Paul, J.; Brophy, J.J.; Perez-Alonso, M.J.; Usano, J.; Soria, S.C., Essential oil composition of the different parts of Eryngium corniculatum Lam. (Apiaceae) from Spain, J. Chromatogr. A, 2007, 1175, 2, 289-293, https://doi.org/10.1016/j.chroma.2007.10.061 . [all data]

Bazargani, Almasirad, et al., 2006
Bazargani, Y.T.; Almasirad, A.; Amin, G.; Shafiee, A., Chemical composition of the essential oils of Astrodaucus persicus (Boiss.) Drude root, stem/leaves and flowers/fruits, Flavour Fragr. J., 2006, 21, 2, 294-296, https://doi.org/10.1002/ffj.1589 . [all data]

Borges, Rojas, et al., 2006
Borges, R.; Rojas, L.B.; Cegarra, J.A.; Usubillaga, A., Study of the essential oils from the leaves and flowers of Lepechinia conferta (Benth) Epl., Flavour Fragr. J., 2006, 21, 1, 155-157, https://doi.org/10.1002/ffj.1550 . [all data]

Boti, Yao, et al., 2006
Boti, J.B.; Yao, P.A.; Koukoua, G.; N'Guessan, T.Y.; Casanova, J., Components and chemical variability of Isolona campanulata Engler Diels leaf oil, Flavour Fragr. J., 2006, 21, 1, 166-170, https://doi.org/10.1002/ffj.1555 . [all data]

Coronel, Cerda-Garcia-Rojas, et al., 2006
Coronel, A. del.C.; Cerda-Garcia-Rojas, C.M.; Joseph-Nathan, P.; Catalán, C.A.N., Chemical composition, seasonal variation and a new sesquiterpene alcohol from the essential oil of Lippia integrifolia, Flavour Fragr. J., 2006, 21, 5, 839-847, https://doi.org/10.1002/ffj.1736 . [all data]

Garneau F.X., Collin G., et al., 2006
Garneau F.X.; Collin G.; Gagnon H.; Jean F.I.; Strobl H.; Pichette A., The essential oil composition of Devil's Club, Oplopanax horridus J. E. Smith Miq., Flavour Fragr. J., 2006, 21, 5, 792-794, https://doi.org/10.1002/ffj.1716 . [all data]

Javidnia, Miri, et al., 2006
Javidnia, K.; Miri, R.; Kamalinejad, M.; Mehdipour, A.R., Composition of the essential oil of Diplotaenia cachrydifolia Boiss. from Iran, J. Ess. Oil Res., 2006, 18, 1, 86-87, https://doi.org/10.1080/10412905.2006.9699393 . [all data]

Kim, Abd El-Aty, et al., 2006
Kim, M.R.; Abd El-Aty, A.M.; Kim, I.S.; Shim, J.H., Determination of volatile flavor components in danggui cultivars by solvent free injection and hydrodistillation followed by gas chromatographic-mass spectrometric analysis, J. Chromatogr. A, 2006, 1116, 1-2, 259-264, https://doi.org/10.1016/j.chroma.2006.03.060 . [all data]

Lan Phi N.T., Nishiyama C., et al., 2006
Lan Phi N.T.; Nishiyama C.; Choi H.-S.; Sawamura M., Evaluation of aroma characteristic compounds of Citrus natsudaidai Hayata (Natsudaidai) cold-pressed peel oil, Biosci. Biotechnol. Biochem., 2006, 70, 8, 1832-1838, https://doi.org/10.1271/bbb.50705 . [all data]

Lesueur, Ban, et al., 2006
Lesueur, D.; Ban, N.K.; Bighelli, A.; Muselli, A.; Casanova, J., Analysis of the root oil of Fokienia hodginsii (Dunn) Henry et Thomas (Cupressaceae) by GC, GC-MS and 13C-NMR, Flavour Fragr. J., 2006, 21, 1, 171-174, https://doi.org/10.1002/ffj.1557 . [all data]

Lis and Milczarek, 2006
Lis, A.; Milczarek, J., Chemical composition of the essential oils from fruits, leaves and flowers of Phellodendron sachalinense (Fr. Schmidt) Sarg., Flavour Fragr. J., 2006, 21, 4, 683-686, https://doi.org/10.1002/ffj.1662 . [all data]

Morteza-Semnani K., Saeedi M., et al., 2006
Morteza-Semnani K.; Saeedi M.; Changizi S., The essential oil composition of Hypericum scabrum L. from Iran, Flavour Fragr. J., 2006, 21, 3, 513-515, https://doi.org/10.1002/ffj.1614 . [all data]

Pandey-Rai S., Mallavarapu G.R., et al., 2006
Pandey-Rai S.; Mallavarapu G.R.; Naqvi A.A.; Yadav A.; Rai S.K.; Srivastava S.; Singh D.; Mishra R.; Kumar S., Volatile components of leaves and flowers of periwinkle Catharanthus roseus (L.) G. Don from New Delhi, Flavour Fragr. J., 2006, 21, 3, 427-430, https://doi.org/10.1002/ffj.1606 . [all data]

Pino, Marbot, et al., 2006
Pino, J.A.; Marbot, R.; Payo, A.; Chao, D.; Herrera, P., Aromatic Plants from Western Cuba VII. Composition of the Leaf Oil of Psidium wrightii KRug et Urb., Lantana involucrata L., Cinnamonum montanum (Sw.) Berchtold et J. Persl. and Caesalpinia violacea (Mill.) Standley, J. Essent. Oil. Res., 2006, 18, 2, 170-174, https://doi.org/10.1080/10412905.2006.9699058 . [all data]

Robinson, 2006
Robinson, C.J., A new essential oil - Agonis fragrans, A report for the Rural Industries Research and Development Corporation, RIRDC Publication No. 06/090, Rural Industries Research and Development Corporation, Barton, ACT, 2006, 12. [all data]

Trilles, Bombarda, et al., 2006
Trilles, B.L.; Bombarda, I.; Bouraïma-Madjebi, S.; Raharivelomanana, P.; Bianchini, J.-P.; Gaydou, E.M., Occurrence of various chemotypes in niaouli [Melaleuca quinquenervia (Cav.) S. T. Blake] essential oil from New Caledonia, Flavour Fragr. J., 2006, 21, 4, 677-682, https://doi.org/10.1002/ffj.1649 . [all data]

Wang, Kong, et al., 2006
Wang, P.; Kong, C.H.; Zhang, C.X., Chemical Composition and Antimicrobial Activity of the Essential Oil from Ambrosia trifida L., Molecules, 2006, 11, 7, 549-555, https://doi.org/10.3390/11070549 . [all data]

Wang, Yang, et al., 2006
Wang, Q.; Yang, Y.; Zhao, X.; Zhu, B.; Nan, P.; Zhao, J.; Wang, L.; Chen, F.; Liu, Z.; Zhong, Y., Chemical variation in the essential oil of Ephedra sinica from Northeastern China, Food Chem., 2006, 98, 1, 52-58, https://doi.org/10.1016/j.foodchem.2005.04.033 . [all data]

Cégiéla-Carlioz, Bessière, et al., 2005
Cégiéla-Carlioz, P.; Bessière, J.-M.; David, B.; Mariotte, A.-M.; Gibbons, S.; Dijoux-Franca, M.-G., Modulation of multi-drug resistance (MDR) in Staphylococcus aureus by Osha (Ligusticum porteri L., Apiaceae) essential oil compounds, Flavour Fragr. J., 2005, 20, 6, 671-675, https://doi.org/10.1002/ffj.1584 . [all data]

Duarte, Figueira, et al., 2005
Duarte, M.C.T.; Figueira, G.M.; Sartoratto, A.; Rehder, V.L.G.; Delarmelina, C., Anti-Candida activity of Brazilian medicinal plants, J. Ethnopharmacol., 2005, 97, 2, 305-311, https://doi.org/10.1016/j.jep.2004.11.016 . [all data]

Ferraz, Limberger, et al., 2005
Ferraz, A.B.F.; Limberger, R.P.; Bordignon, S.A.L.; von Poser, G.L.; Henriques, A.T., Essential oil composition of six Hypericum species from southern Brazil, Flavour Fragr. J., 2005, 20, 3, 335-339, https://doi.org/10.1002/ffj.1435 . [all data]

Gauvin and Smadja, 2005
Gauvin, A.; Smadja, J., Essential oil composition of four Psiadia species from Reunion Island: A chemotaxonomic study, Biochem. Syst. Ecol., 2005, 33, 7, 705-714, https://doi.org/10.1016/j.bse.2004.12.013 . [all data]

Ghasemi Y., Faridi P., et al., 2005
Ghasemi Y.; Faridi P.; Mehregan I.; Mohagheghzadeh A., Ferula gummosa fruits: An aromatic antimicrobial agent, Chem. Nat. Compd. (Engl. Transl.), 2005, 41, 3, 311-314, https://doi.org/10.1007/s10600-005-0138-3 . [all data]

Morteza-Semnani and Saeedi, 2005
Morteza-Semnani, K.; Saeedi, M., The essential oil composition of Phlomis bruguieri Desf. from Iran, Flavour Fragr. J., 2005, 20, 3, 344-346, https://doi.org/10.1002/ffj.1459 . [all data]

Sajjadi, 2005
Sajjadi, S.E., Analysis of the essential oil of Nepeta sintenisii Bornm. from Iran, DARU, 2005, 13, 2, 61-64. [all data]

Singh, Raina, et al., 2005
Singh, A.K.; Raina, V.K.; Naqvi, A.A.; Patra, N.K.; Kumar, B.; Ram, P.; Khanuja, S.P.S., Essential oil composition and chemoarrays of menthol mint (Mentha arvensis L. f. piperascens Malinvaud ex. Holmes) cultivars, Flavour Fragr. J., 2005, 20, 3, 302-305, https://doi.org/10.1002/ffj.1417 . [all data]

Sonboli A., Fakhari A.R., et al., 2005
Sonboli A.; Fakhari A.R.; Sefidkon F., Chemical composition of the essential oil of Salvia macilenta from Iran, Chem. Nat. Compd. (Engl. Transl.), 2005, 41, 2, 168-170, https://doi.org/10.1007/s10600-005-0104-0 . [all data]

Sonboli, Salehi, et al., 2005
Sonboli, A.; Salehi, P.; Ebrahimi, S.N., Essential oil composition and antibacterial activity of the leaves of Stachys schtschegleevii from Iran, Chem. Nat. Compd. (Engl. Transl.), 2005, 41, 2, 171-175, https://doi.org/10.1007/s10600-005-0105-z . [all data]

Suárez, Vásquez, et al., 2005
Suárez, A.I.; Vásquez, L.J.; Manzano, M.A.; Compagnone, R.S., Essential oil composition of Croton cuneatus and Croton malambo growing in Venezuela, Flavour Fragr. J., 2005, 20, 6, 611-614, https://doi.org/10.1002/ffj.1498 . [all data]

Watanabe Y., Mihara R., et al., 2005
Watanabe Y.; Mihara R.; Mitsunaga T.; Yoshimura T., Termite repellent sesquiterpenoids from Callitris glaucophylla heartwood, J. Wood Sci., 2005, 51, 5, 514-519, https://doi.org/10.1007/s10086-004-0683-6 . [all data]

Gauvin, Ravaomanarivo, et al., 2004
Gauvin, A.; Ravaomanarivo, H.; Smadja, J., Comparative analysis by gas chromatography?mass spectrometry of the essential oils from bark and leaves of Cedrelopsis grevei Baill, an aromatic and medicinal plant from Madagascar, J. Chromatogr. A, 2004, 1029, 1-2, 279-282, https://doi.org/10.1016/j.chroma.2003.12.012 . [all data]

Lago, de Ávila, et al., 2004
Lago, J.H.G.; de Ávila, P., Jr.; de Aquino, E.M.; Moreno, P.R.H.; Ohara, M.T.; Limberger, R.P.; Apel, M.A.; Henriques, A.T., Volatile oils from leaves and stem barks of Cedrela fissilis (Meliaceae): chemical composition and antibacterial activities, Flavour Fragr. J., 2004, 19, 5, 448-451, https://doi.org/10.1002/ffj.1347 . [all data]

Lis, Boczek, et al., 2004
Lis, A.; Boczek, E.; Góra, J., Chemical composition of the essential oils from fruits, leaves and flowers of the Amur cork tree (Phellodendron amurense Rupr.), Flavour Fragr. J., 2004, 19, 6, 549-553, https://doi.org/10.1002/ffj.1349 . [all data]

Lopez Arze, Collin, et al., 2004
Lopez Arze, J.B.; Collin, G.; Garneau, F.-X.; Jean, F.-I.; Gagnon, H., Essential oils from Bolivia. II. Asteraceae: Ophryosporus heptanthus (Wedd.) H. Rob. et King, J. Essent. Oil Res., 2004, 16, 4, 374-376, https://doi.org/10.1080/10412905.2004.9698747 . [all data]

Tellez, Khan, et al., 2004
Tellez, M.R.; Khan, I.A.; Schaneberg, B.T.; Crockett, S.L.; Rimando, A.M.; Kobaisy, M., Steam distillation-solid-phase microextraction for the detection of Ephedra sinica in herbal preparations, J. Chromatogr. A, 2004, 1025, 1, 51-56, https://doi.org/10.1016/S0021-9673(03)01035-5 . [all data]

Couladis, Özcan, et al., 2003
Couladis, M.; Özcan, M.; Tzakou, O.; Akgül, A., Comparative essential oil composition of various parts of the turpentine tree (Pistacia terebinthus L) growing wild in Turkey, J. Sci. Food Agric., 2003, 83, 2, 136-138, https://doi.org/10.1002/jsfa.1295 . [all data]

Fekam Boyom, Ngouana, et al., 2003
Fekam Boyom, F.; Ngouana, V.; Amvam Zollo, P.H.; Menut, C.; Bessiere, J.M.; Gut, J.; Rosenthal, P.J., Composition and anti-plasmodial activities of essential oils from some Cameroonian medicinal plants, Phytochemistry, 2003, 64, 7, 1269-1275, https://doi.org/10.1016/j.phytochem.2003.08.004 . [all data]

Jirovetz, Buchbauer, et al., 2003
Jirovetz, L.; Buchbauer, G.; Shafi, M.P.; Kaniampady, M.M., Chemotaxonomical analysis of the essential oil aroma compounds of four different Ocimumspecies from southern India, Eur. Food Res. Technol., 2003, 217, 2, 120-124, https://doi.org/10.1007/s00217-003-0708-1 . [all data]

Jirovetz, Buchbauer, et al., 2003, 2
Jirovetz, L.; Buchbauer, G.; Shafi, M.P.; Leela, N.K., Analysis of the essential oils of the leaves, stems, rhizomes and roots of the medicinal plant Alpinia galanga from southern India, Acta Pharm. Hung., 2003, 53, 73-81. [all data]

Pourmortazavi, Sefidkon, et al., 2003
Pourmortazavi, S.M.; Sefidkon, F.; Hosseini, S.G., Supercritical carbon dioxide extraction of essential oils from Perovskia atriplicifolia Benth., J. Agric. Food Chem., 2003, 51, 18, 5414-5419, https://doi.org/10.1021/jf0341619 . [all data]

Yassa, Akhani, et al., 2003
Yassa, N.; Akhani, H.; Aqaahmadi, M.; Salimian, M., Essential oils from two endemic species of Apiaceae from Iran, Z. Naturforsch. C:, 2003, 58, 459-463. [all data]

Cimanga, Apers, et al., 2002
Cimanga, K.; Apers, S.; de Bruyne, T.; van Miert, S.; Hermans, N.; Totté, J.; Pieters, L.; Vlietinck, A.J., Chemical composition and antifungal activity of essential oils of some aromatic medicinal plants growing in the democratic republic of Congo, J. Essent. Oil Res., 2002, 14, 5, 382-387, https://doi.org/10.1080/10412905.2002.9699894 . [all data]

Farah, Fechtal, et al., 2002
Farah, A.; Fechtal, M.; Chaouch, A., Effet de l'hybridation interspécifique sur la teneur et la composition chimique des huiles essentielles d'eucalyptus cultivés au Maroc, Biotechnol. Agron. Soc. Environ., 2002, 6, 3, 163-169. [all data]

Farah, Fechtal. M., et al., 2002
Farah, A.; Fechtal. M.; Chaouch, A.; Zrira, S., The essential oils of Eucalyptus camaldulensis and its natural hybrid (clone 583) from Morocco, Flavour Fragr. J., 2002, 17, 5, 395-397, https://doi.org/10.1002/ffj.1114 . [all data]

Flamini, Ertugrul, et al., 2002
Flamini, G.; Ertugrul, K.; Cioni, P.L.; Morelli, I.; Dural, H.; Bagci, Y., Volatile constituents of two endemic Centaurea species from Turkey: C. pseudoscabiosa subsp. pseudoscabiosa and C. hadimensis, Biochem. Syst. Ecol., 2002, 30, 10, 953-959, https://doi.org/10.1016/S0305-1978(02)00043-1 . [all data]

Maia, Zoghbi, et al., 2002
Maia, J.G.S.; Zoghbi, M.G.B.; Andrade, E.H.A.; da Silva, M.H.L.; Luz, A.I.R.; da Silva, J.D., Essential oils composition of Eupatorium species growing wild in the Amazon, Biochem. Syst. Ecol., 2002, 30, 11, 1071-1077, https://doi.org/10.1016/S0305-1978(02)00059-5 . [all data]

Velasco-Negueruela, Pérez-Alonso, et al., 2002
Velasco-Negueruela, A.; Pérez-Alonso, M.J.; Palá-Paúl, J.; Íñigo, A.; López, G., Leaf essential oils analysis of Juniperus navicularis Gandoger, Botanica Complutensis, 2002, 26, 85-91. [all data]

Dabiri and Sefidkon, 2001
Dabiri, M.; Sefidkon, F., Analysis of the essential oil from aerial parts of Perovskia atriplicifolia Benth. at different stages of plant growth, Flavour Fragr. J., 2001, 16, 6, 435-438, https://doi.org/10.1002/ffj.988 . [all data]

Gupta, Mallavarapu, et al., 2001
Gupta, R.; Mallavarapu, G.R.; Banerjee, S.; Kumar, S., Characteristics of an isomenthone-rich somaclonal mutant isolated in a geraniol-rich rose-scented geranium accession of Pelargonium graveolens, Flavour Fragr. J., 2001, 16, 5, 319-324, https://doi.org/10.1002/ffj.1002 . [all data]

Marongiu, Porcedda, et al., 2001
Marongiu, B.; Porcedda, S.; Porta, G.D.; Reverchon, E., Extraction and isolation of Salvia desoleana and Mentha spicata subsp. insularis essential oils by supercritical CO2, Flavour Fragr. J., 2001, 16, 5, 384-388, https://doi.org/10.1002/ffj.1021 . [all data]

Palmeira, Conserva, et al., 2001
Palmeira, S.F., Jr.; Conserva, L.M.; Andrade, E.H.A.; Guilhon, G.M.S.P., Analysis by GC-MS of the hexane extract of the aerial parts of Aristolochia acutifolia Duchtr., Flavour Fragr. J., 2001, 16, 2, 85-88, https://doi.org/10.1002/1099-1026(200103/04)16:2<85::AID-FFJ948>3.0.CO;2-2 . [all data]

Rousis, Papadogianni, et al., 2001
Rousis, V.; Papadogianni, K.; Vagias, C.; Harvala, C.; Petrakis, P.V.; Ortiz, A., Volatile constituents of three Pinus species grown in Greece, J. Essent. Oil Res., 2001, 13, 2, 118-121, https://doi.org/10.1080/10412905.2001.9699632 . [all data]

Santos, Moreira, et al., 2001
Santos, P.R.; Moreira, D.L.; Guimaraes, E.F.; Kaplan, M.A.C., Essential oil analysis of 10 piperaceae species from the Brazilian Atlantic forest, Phytochemistry, 2001, 58, 4, 547-551, https://doi.org/10.1016/S0031-9422(01)00290-4 . [all data]

Menon, Chacko, et al., 1999
Menon, A.N.; Chacko, S.; Narayanan, C.S., Free and glycosidically bound volatiles of cardamom (Eletteria cardamomum Maton var. miniscula Burkill), Flavour Fragr. J., 1999, 14, 1, 65-68, https://doi.org/10.1002/(SICI)1099-1026(199901/02)14:1<65::AID-FFJ789>3.0.CO;2-A . [all data]

Zoghbi, Andrade, et al., 1999
Zoghbi, M.G.B.; Andrade, E.H.A.; Maia, J.G.S., Volatile constituents from leaves and flowers of Alpinia speciosa K. Schum. and A. purpurata (Viell.) Schum., Flavour Fragr. J., 1999, 14, 6, 411-414, https://doi.org/10.1002/(SICI)1099-1026(199911/12)14:6<411::AID-FFJ854>3.0.CO;2-U . [all data]

Santos, Andrade, et al., 1998
Santos, A.S.; Andrade, E.H.A.; Zoghbi, M. das.G.B.; Luz, A.I.R.; Maia, J.G.S., Sesquiterpenes of Amazonian Piper species, Acta Amazomica, 1998, 28, 2, 127-130. [all data]

Zollo, Biyiti, et al., 1998
Zollo, P.H.A.; Biyiti, L.; Tchoumbougnang, F.; Menut, C.; Lamaty, G.; Bouchet, Ph., Aromatic plants of tropical central Africa. Part XXXII. Chemical composition and antifungal activity of thirteen essential oils from aromatic plants of Cameroon, Flavour Fragr. J., 1998, 13, 2, 107-114, https://doi.org/10.1002/(SICI)1099-1026(199803/04)13:2<107::AID-FFJ701>3.0.CO;2-G . [all data]

Abreu and Noronha, 1997
Abreu, P.M.; Noronha, R.G., Volatile constituents of the rhizomes of Aframomum alboviolaceum (Ridley) K. Schum. from Guinea-Bissau, Flavour Fragr. J., 1997, 12, 2, 79-83, https://doi.org/10.1002/(SICI)1099-1026(199703)12:2<79::AID-FFJ617>3.0.CO;2-7 . [all data]

Salgueiro, Vila, et al., 1997
Salgueiro, L.R.; Vila, R.; Tomi, F.; Figueiredo, A.C.; Barroso, J.G.; Cañigueral, S.; Casanova, J.; da Cunha, A.P.; Adzet, T., Variability of essential oils of Thymus caespititius from Portugal, Phytochemistry, 1997, 45, 2, 307-311, https://doi.org/10.1016/S0031-9422(96)00872-2 . [all data]

Tellez, Estell, et al., 1997
Tellez, M.R.; Estell, R.E.; Frederickson, E.L.; Havstad, K.M., Essntial oil of Flourensia cernua DC, J. Essent. Oil Res., 1997, 9, 6, 619-624, https://doi.org/10.1080/10412905.1997.9700799 . [all data]

Ayedoun, Adeoti, et al., 1996
Ayedoun, A.M.; Adeoti, B.S.; Sossou, P.V.; Leclerq, P.A., Influence of fruit conservation methods on the essential oil composition of xylopia aethiopica (Dunal) A. Richard from Benin, Flavour Fragr. J., 1996, 11, 4, 245-250, https://doi.org/10.1002/(SICI)1099-1026(199607)11:4<245::AID-FFJ583>3.0.CO;2-K . [all data]

Chacko, Jayalekshmy, et al., 1996
Chacko, S.; Jayalekshmy, A.; Gopalakrishnan, M.; Narayanan, C.S., Roasting studies on black pepper (Piper nigrum L.), Flavour Fragr. J., 1996, 11, 5, 305-310, https://doi.org/10.1002/(SICI)1099-1026(199609)11:5<305::AID-FFJ588>3.0.CO;2-1 . [all data]