2-Naphthalenemethanol, decahydro-α,α,4a-trimethyl-8-methylene-, [2R-(2α,4aα,8aβ)]-

Kovats' RI, non-polar column, custom temperature program

Data compiled by: NIST Mass Spectrometry Data Center, William E. Wallace, director

Column type CapillaryCapillaryCapillaryCapillaryCapillary
Active phase HP-5DB-5DB-5MSOV-1DB-5
Column length (m)  30.30.30.30.
Carrier gas HeHeHeHeHe
Substrate
Column diameter (mm)  0.250.250.250.25
Phase thickness (μm)  0.10.250.25
Program 60C(5min) => 3C/min => 100C => 1C/min => 160C => 10C/min => 240C(10min)35C => 4C/min => 180C => 20C/min => 280C60C(5min) => 2C/min => 140C= 5C/min => 250C(5min)44C(4min) => 3C/min => 74C => 6C/min => 134C => 12C/min => 312Cnot specified
I 1649.1610.1674.1633.1648.
Referencede Marchese, de Heluani, et al., 2007Lima, Barros, et al., 2005Tuberoso, Kowalczyk, et al., 2005El-Shazly, Dorai, et al., 2002Rao, Rout, et al., 2000
Comment MSDC-RI MSDC-RI MSDC-RI MSDC-RI MSDC-RI

Normal alkane RI, polar column, temperature ramp

Data compiled by: NIST Mass Spectrometry Data Center, William E. Wallace, director

Column type CapillaryCapillaryCapillaryCapillaryCapillary
Active phase BP-20DB-WaxSupelcowax-10RTX-WaxCarbowax
Column length (m) 50.30.30.60.60.
Carrier gas HeliumHeliumNitrogenHeliumHe
Substrate
Column diameter (mm) 0.220.250.250.220.2
Phase thickness (μm) 0.250.250.250.250.25
Tstart (C) 60.80.50.60.60.
Tend (C) 220.240.200.230.250.
Heat rate (K/min) 2.3.5.2.2.
Initial hold (min)     8.
Final hold (min) 20.2. 30.15.
I 2219.2220.2200.2229.2227.
ReferenceYapi, Boti, et al., 2012Vahirua-Lechat, Mitermite, et al., 2010Hnawia, Menut, et al., 2009Museli, Pau, et al., 2009Ferhat, Tigrine-Kordjani, et al., 2007
Comment MSDC-RI MSDC-RI MSDC-RI MSDC-RI MSDC-RI
Column type CapillaryCapillaryCapillaryCapillaryCapillary
Active phase HP-InnowaxDB-WaxSupelcowax-10Supelcowax-10Innowax
Column length (m) 30.60.30.30.30.
Carrier gas HeHeHeHeN2
Substrate
Column diameter (mm) 0.250.320.250.250.25
Phase thickness (μm) 0.250.250.250.250.25
Tstart (C) 60.70.50.40.50.
Tend (C) 240.220.250.250.280.
Heat rate (K/min) 2.4.2.3.9.
Initial hold (min)    5.3.
Final hold (min) 20.  10.3.
I 2211.2239.2272.2203.2215.
ReferenceHachicha, Skanji, et al., 2007Pala-Paul, Brophy, et al., 2007Raal, Orav, et al., 2007Vichi, Riu-Aumatell, et al., 2007Abdelwahed, Hayder, et al., 2006
Comment MSDC-RI MSDC-RI MSDC-RI MSDC-RI MSDC-RI
Column type CapillaryCapillaryCapillaryCapillaryCapillary
Active phase InnowaxAT-WaxBP-20DB-WaxSupelcowax 10
Column length (m) 30.60.50.60.30.
Carrier gas N2He HeHelium
Substrate
Column diameter (mm) 0.250.250.220.250.20
Phase thickness (μm) 0.250.250.250.50.20
Tstart (C) 50.60.60.50.70.
Tend (C) 280.200.220.230.220.
Heat rate (K/min) 9.4.2.3.3.
Initial hold (min) 3.  2.
Final hold (min) 3.20.20.20.15.
I 2220.2261.2230.2213.2215.
ReferenceAbdelwahed, Hayder, et al., 2006Borges, Rojas, et al., 2006Boti, Yao, et al., 2006Cai, Lin, et al., 2006Cavaleiro, Pinto, et al., 2006
Comment MSDC-RI MSDC-RI MSDC-RI MSDC-RI MSDC-RI
Column type CapillaryCapillaryCapillaryCapillaryCapillary
Active phase DB-WaxCP-Wax 52CBDB-WaxBP-20Carbowax-PEG
Column length (m) 60.30.60.50.60.
Carrier gas N2He HeHelium
Substrate
Column diameter (mm) 0.250.320.250.220.20
Phase thickness (μm) 0.250.250.250.250.25
Tstart (C) 70.60.70.60.60.
Tend (C) 230.220.230.220.250.
Heat rate (K/min) 2.3.32.2.2.
Initial hold (min) 2.7.2. 8.
Final hold (min) 20.3.20.20.15.
I 2218.2255.2233.2232.2227.
ReferenceChoi, 2006Hymete, Rohloff, et al., 2006Lan Phi N.T., Nishiyama C., et al., 2006Lesueur, Ban, et al., 2006Tigrine-Kordiani, Meklati, et al., 2006
Comment MSDC-RI MSDC-RI MSDC-RI MSDC-RI MSDC-RI
Column type CapillaryCapillaryCapillaryCapillaryCapillary
Active phase Supelcowax-10InnowaxSupelcowaxStabilwaxInnowax
Column length (m) 30.50.60.30.60.
Carrier gas HeHeHeH2He
Substrate
Column diameter (mm) 0.250.20.20.320.25
Phase thickness (μm) 0.250.50.20.50.25
Tstart (C) 50.60.60.40.60.
Tend (C) 250.250.230.280.240.
Heat rate (K/min) 4.2.4.6.5.
Initial hold (min) 1. 30.5.
Final hold (min) 10.60. 5.30.
I 2214.2222.2196.2193.2256.
ReferenceWong, Sivasothy, et al., 2006Bendimerad and Bendiab, 2005Gauvin and Smadja, 2005Jirovetz, Buchbauer, et al., 2005Joichi, Yomogida, et al., 2005
Comment MSDC-RI MSDC-RI MSDC-RI MSDC-RI MSDC-RI
Column type CapillaryCapillaryCapillaryCapillaryCapillary
Active phase DB-WaxZB-WaxBP-20DB-WaxSupelcowax-10
Column length (m) 30.30.50.60.30.
Carrier gas HeHelium N2N2
Substrate
Column diameter (mm) 0.250.320.220.250.25
Phase thickness (μm) 0.250.250.250.250.25
Tstart (C) 50.40.60.70.40.
Tend (C) 180.250.220.230.230.
Heat rate (K/min) 3.5.2.2.2.
Initial hold (min)  2. 2.
Final hold (min) 40.5.20.20.
I 2225.2192.2227.2245.2283.
ReferenceLee, Umano, et al., 2005N/ABlanc, Muselli, et al., 2004Choi, 2004González, Guerra, et al., 2004
Comment MSDC-RI MSDC-RI MSDC-RI MSDC-RI MSDC-RI
Column type CapillaryCapillaryCapillaryCapillaryCapillary
Active phase DB-WaxSupelcowax-10Innowax FSCBP-20TC-Wax
Column length (m) 60.30.60.25.60.
Carrier gas He HeliumH2
Substrate
Column diameter (mm) 0.250.250.250.330.25
Phase thickness (μm)  0.25 0.5
Tstart (C) 60.40.60.80.80.
Tend (C) 220.210.220.220.240.
Heat rate (K/min) 2.2.4.5.3.
Initial hold (min) 4.2.10.
Final hold (min)  33.
I 2242.2222.2257.2244.2215.
ReferenceJiang and Kubota, 2004Lopez Arze, Collin, et al., 2004Lourens, Reddy, et al., 2004Dunlop, Bignell, et al., 2003Miyazawa, Yamafuji, et al., 2003
Comment MSDC-RI MSDC-RI MSDC-RI MSDC-RI MSDC-RI
Column type CapillaryCapillaryCapillaryCapillaryCapillary
Active phase DB-WaxSupelcowax-10InnowaxSupelcowax-10DB-Wax
Column length (m) 60.30.60.30.60.
Carrier gas HeliumN2He He
Substrate
Column diameter (mm) 0.250.250.250.250.25
Phase thickness (μm)  0.25 0.250.25
Tstart (C) 70.40.60.40.45.
Tend (C) 210.230.220.210.240.
Heat rate (K/min) 2.2.4.2.3.
Initial hold (min)   10.2.
Final hold (min) 60. 10.33.
I 2234.2283.2257.2188.2230.
ReferenceMookdasanit, Tamura, et al., 2003Rotman, Ahumada, et al., 2003Suleimenov, Atazharova, et al., 2003Kabouss, Charrouf, et al., 2002Christoph, 2001
Comment MSDC-RI MSDC-RI MSDC-RI MSDC-RI MSDC-RI
Column type CapillaryCapillaryCapillaryCapillaryCapillary
Active phase StabilwaxBP-20DB-WaxBP-20NB-351
Column length (m) 30.25.60.25.25.
Carrier gas H2NitrogenHelium H2
Substrate
Column diameter (mm) 0.320.500.320.330.3
Phase thickness (μm) 0.250.250.250.50.5
Tstart (C) 60.60.50.80.70.
Tend (C) 280.200.230.220.250.
Heat rate (K/min) 10.5.5.5.5.
Initial hold (min) 5. 2. 2.
Final hold (min) 5.
I 2222.2252.2229.2244.2212.
ReferenceJirovetz L., Buchbauer G., et al., 2001Mallavarapu, Rao, et al., 2000Paniandy, Chane-Ming, et al., 2000Dunlop, Bignell, et al., 1999Onocha, Ekundayo, et al., 1999
Comment MSDC-RI MSDC-RI MSDC-RI MSDC-RI MSDC-RI
Column type CapillaryCapillaryCapillaryCapillaryCapillary
Active phase DB-WaxBP-20HP-InnowaxDB-WaxBP-20
Column length (m) 60.25.60.30.25.
Carrier gas N2H2HeHeH2
Substrate
Column diameter (mm)  0.330.250.320.33
Phase thickness (μm) 0.250.50.25 0.5
Tstart (C) 60.80.50.60.80.
Tend (C) 220.220.220.250.220.
Heat rate (K/min) 5.5.5.3.5.
Initial hold (min)   5.
Final hold (min)
I 2256.2244.2248.2246.2244.
ReferenceWeyerstahl, Marschall, et al., 1999Bignell, Dunlop, et al., 1998Stashenko, Cervantes, et al., 1998Abreu and Noronha, 1997Bignell, Dunlop, et al., 1997
Comment MSDC-RI MSDC-RI MSDC-RI MSDC-RI MSDC-RI
Column type CapillaryCapillaryCapillaryCapillaryCapillary
Active phase BP-20BP-20BP-20BP-20BP-20
Column length (m) 25.25.25.25.25.
Carrier gas H2H2H2 H2
Substrate
Column diameter (mm) 0.330.330.330.330.33
Phase thickness (μm) 0.50.50.50.50.5
Tstart (C) 80.80.80.80.80.
Tend (C) 220.220.220.220.220.
Heat rate (K/min) 5.5.5.5.5.
Initial hold (min)
Final hold (min)
I 2244.2244.2244.2244.2244.
ReferenceBignell, Dunlop, et al., 1997, 2Bignell, Dunlop, et al., 1997, 3Bignell, Dunlop, et al., 1997, 4Bignell, Dunlop, et al., 1997, 5Bignell, Dunlop, et al., 1997, 6
Comment MSDC-RI MSDC-RI MSDC-RI MSDC-RI MSDC-RI
Column type CapillaryCapillaryCapillaryCapillaryCapillary
Active phase Supelcowax-10TC-WaxSupelcowax-10DB-WaxDB-Wax
Column length (m) 0.60.60.60.60.
Carrier gas He HeHydrogenH2
Substrate
Column diameter (mm) 0.250.250.250.250.25
Phase thickness (μm)   0.250.250.25
Tstart (C) 40.80.40.50.50.
Tend (C) 240.240.200.238.238.
Heat rate (K/min) 3.3.3.4.4.
Initial hold (min)  5.3.
Final hold (min)   30.8.13.
I 2283.2250.2283.2242.2248.
ReferenceZygadlo, Ariza-Espinar, et al., 1997Shuichi, Masazumi, et al., 1996Wong and Lai, 1996Kesselmans and Wijnberg, 1992van Beek, Kleis, et al., 1989
Comment MSDC-RI MSDC-RI MSDC-RI MSDC-RI MSDC-RI

Normal alkane RI, non-polar column, custom temperature program

Data compiled by: NIST Mass Spectrometry Data Center, William E. Wallace, director

Column type CapillaryCapillaryCapillaryCapillaryCapillary
Active phase TR-5 MSTR-5 MSRTX-5 MSDB-15 % Phenyl polydimethyl siloxane
Column length (m) 15.15.30.30.
Carrier gas HeliumHeliumHeliumHydrogen
Substrate
Column diameter (mm) 0.250.250.250.25
Phase thickness (μm) 0.250.25 0.25
Program 35 0C (3 min) 2 0C/min -> 60 0C (3 min) 2 0C/min -> 80 0C (3 min) 4 0C/min -> 120 0C (3 min) 5 0C/min -> 150 0C (3 min) 15 0C/min -> 240 0C (10 min)35 0C (3 min) 2 0C/min -> 60 0C (3 min) 2 0C/min -> 80 0C (3 min) 4 0C/min -> 120 0C (3 min) 5 0C/min -> 150 0C (3 mion) 15 0C/min -> 240 0C (10 min)not specified45 0C 3 0C/min -> 175 0C 15 0C/min -> 300 0C (10 min)not specified
I 1639.1646.1649.1620.1655.
ReferenceKurashov, Mitrukova, et al., 2014Kurashov, Krylova, et al., 2013Pinheiro, de Queiros, et al., 2013Albano, Lima, et al., 2012Chaverri, Diaz, et al., 2011
Comment MSDC-RI MSDC-RI MSDC-RI MSDC-RI MSDC-RI
Column type CapillaryCapillaryCapillaryCapillaryCapillary
Active phase CBP-5HP-5HP-5 MSHP-5DB-5
Column length (m) 30.30.30.30.30.
Carrier gas HeliumHeliumHelium Helium
Substrate
Column diameter (mm) 0.250.320.250.320.25
Phase thickness (μm) 0.250.250.25 0.25
Program 60 0C 3 0C/min -> 246 0C 10 0C/min -> 270 0C (5 min)not specified40 0C (5 min) 2 0C/min -> 270 0C -> 260 0C (20 min)not specified50 0C 95 min) 3 0C/min -> 100 0C 4 0C/min -> 160 0C 5 0C/min -> 220 0C (15 min)
I 1654.1651.1650.1649.1662.
ReferenceFortes, Naves, et al., 2011Kahriman, Tosun, et al., 2011Mancini, Arnold, et al., 2009Riahi, Pourbasheer, et al., 2009Yang, Yang, et al., 2009
Comment MSDC-RI MSDC-RI MSDC-RI MSDC-RI MSDC-RI
Column type CapillaryCapillaryCapillaryCapillaryCapillary
Active phase DB-5SLB-5 MSSLB-5 MSCP Sil 8 CBRTX-5
Column length (m) 25.30.30.30.30.
Carrier gas NitrogenHeliumHelium Helium
Substrate
Column diameter (mm) 0.220.250.250.250.25
Phase thickness (μm) 0.250.250.250.250.25
Program not specified50 0C 3 0C/min -> 250 0C (1 min) 10 0C/min -> 300 0C (5 min)not specified60C => 2.5C/min => 170C => 10C/min => 250C (5min)60 0C (5 min) 5 0C/min -> 110 0C 3 0C/min -> 220 0C (5 min)
I 1648.1658.1649.1649.1656.
ReferenceChieng, Assim, et al., 2008Costa, De Fina, et al., 2008Costa, De Fina, et al., 2008Kristiawan, Sobolik, et al., 2008Zachariah, Leela, et al., 2008
Comment MSDC-RI MSDC-RI MSDC-RI MSDC-RI MSDC-RI
Column type CapillaryCapillaryCapillaryCapillaryCapillary
Active phase RTX-5HP-5MSHP-5MSDB-1HP-5MS
Column length (m) 30.30.30.30.30.
Carrier gas HeliumHeHeH2He
Substrate
Column diameter (mm) 0.250.250.250.250.25
Phase thickness (μm) 0.250.250.250.250.25
Program not specified40C(10min) => 3C/min => 200C => 2C/min => 220C40C(5min) => 2C/min => 250C(15min) => 10C/min => 270C45 0C 3 0C/min -> 175 0C 15 0C/min -> 300 0C (10 min)40C(3min) => 8C/min => 160C => 15C/min => 300C (10min)
I 1649.1648.1650.1620.1661.
ReferenceZachariah, Leela, et al., 2008Cole, Haber, et al., 2007Formisano, Mignola, et al., 2007Kamatou, Viljoen, et al., 2007Liu, Song, et al., 2007
Comment MSDC-RI MSDC-RI MSDC-RI MSDC-RI MSDC-RI
Column type CapillaryCapillaryCapillaryCapillaryCapillary
Active phase HP-1HP-5MSDB-5HP-5 MSHP-5MS
Column length (m) 30.30.50.30.30.
Carrier gas HeHeHeliumHeliumHe
Substrate
Column diameter (mm) 0.20.250.320.250.25
Phase thickness (μm) 0.330.250.25
Program 60C(5min) => 3C/min => 180C => 20C/min => 280C(10min)40C(3min) => 8C/min => 160C => 15C/min => 300C60 0C (1 min) 5 0C/min -> 160 0C 10 0C/min -> 250 0C40 0C (10 min) 3 oC/min -> 200 0C 2 0C/min -> 220 0C40C(10min) => 3C/min => 200C => 2C/min => 220C
I 1649.1647.1651.1648.1650.
ReferenceMerle, Verdeguer, et al., 2007Mu, Wang, et al., 2007Nivinsliene, Butkiene, et al., 2007Setzer, Stokes, et al., 2007Takaku, Haber, et al., 2007
Comment MSDC-RI MSDC-RI MSDC-RI MSDC-RI MSDC-RI
Column type CapillaryCapillaryCapillaryCapillaryCapillary
Active phase HP-5MSDB-5HP-5 MSHP-5MSDB-5
Column length (m) 30.30.30.30.30.
Carrier gas HeHydrogenHeliumHeHe
Substrate
Column diameter (mm) 0.250.250.250.250.32
Phase thickness (μm) 0.250.250.250.250.25
Program 40C(1min) => 8C/min => 160C => 12C/min => 300C(5min)not specified40 0C (10 min) 3 0C/min -> 200 0C 2 0C/min -> 220 0C40C(5min) => 2C/min => 250C (15min) => 10C/min => 270C60C => 2C/min => 100C => 3C/min => 160C => 5C/min => 280C
I 1645.1651.1649.1650.1638.
ReferenceLi, Deng, et al., 2006Pripdeevech, Wongpornchai, et al., 2006Schmidt, Noletto, et al., 2006Senatore, Apostolides Arnold, et al., 2006Srivastava, Mallavarapu, et al., 2006
Comment MSDC-RI MSDC-RI MSDC-RI MSDC-RI MSDC-RI
Column type CapillaryCapillaryCapillaryCapillaryCapillary
Active phase SE-52DB-5BPX5DB-5Methyl Silicone
Column length (m) 30.30.25.30.
Carrier gas HeHeHeliumHe
Substrate
Column diameter (mm) 0.320.250.220.25
Phase thickness (μm) 0.150.250.250.25
Program 45C => 1C/min => 100C => 5C/min => 250C (10min)35C => 4C/min => 180C => 10C/min => 250Cnot specified40C(1min) => 9C/min => 130C => 2C/min => 230Cnot specified
I 1651.1646.1641.1649.1649.
ReferenceTognolini, Barocelli, et al., 2006Cysne, Canuto, et al., 2005Dickschat, Bode, et al., 2005Hamm, Bleton, et al., 2005Couladis, Özcan, et al., 2004
Comment MSDC-RI MSDC-RI MSDC-RI MSDC-RI MSDC-RI
Column type CapillaryCapillaryCapillaryCapillaryCapillary
Active phase  OV-1BPX-5DB-1HP-5
Column length (m)  30.30.30.30.
Carrier gas  HeH2He
Substrate
Column diameter (mm)  0.250.250.250.25
Phase thickness (μm)  0.250.250.250.25
Program not specified45 0C (4 min) 3 0C/min -> 75 0C 4 0C/min -> 115 0C 6 0C/min -> 312 0C50 0C (1 min) 3 0C/min -> 150 0C 5 0C/min -> 250 0C (5 min)45C => 3C/min => 175C => 15C/min => 300C (10min)40C(5min) => 2C/min => 250C(15min) => 10C/min => 270C
I 1633.1634.1651.1620.1650.
ReferenceEl-Shazily, Hafez, et al., 2004Hafez and Abdel-Salam, 2004Koba, Sanda, et al., 2004Miguel, Simões, et al., 2004Senatore, Apostolides Arnold, et al., 2004
Comment MSDC-RI MSDC-RI MSDC-RI MSDC-RI MSDC-RI
Column type CapillaryCapillaryCapillaryCapillaryCapillary
Active phase HP-5SE-30SE-30DB-5DB-1
Column length (m) 30.  30.30.
Carrier gas He  HeHe
Substrate
Column diameter (mm) 0.25  0.250.25
Phase thickness (μm) 0.25  0.250.1
Program 50C (3min) => 3C/min => 150C (10min) => 10C/min => 250Cnot specifiednot specified40C (1min) => 9C/min => 130C => 2C/min => 230C35C => 4C/min => 180C => 10C/min => 250C
I 1651.1633.1634.1649.1630.
ReferenceTepe, Donmez, et al., 2004Vinogradov, 2004Vinogradov, 2004Hamm, Lesellier, et al., 2003Silva, Matos, et al., 2003
Comment MSDC-RI MSDC-RI MSDC-RI MSDC-RI MSDC-RI
Column type CapillaryCapillaryCapillaryCapillaryCapillary
Active phase SE-30SE-30DB-1CP Sil 5 CBCP Sil 5 CB
Column length (m) 60.60.30.25.25.
Carrier gas HeHe N2
Substrate
Column diameter (mm) 0.250.250.25
Phase thickness (μm)   0.250.39
Program 50 0C (5 min) 5 0C/min -> 165 0C 4 0C/min -> 230 0Cnot specified45 0C 3 K/min -> 175 0C 15 K/min -> 300 0C (10 min)not specifiednot specified
I 1658.1657.1620.1640.1638.
ReferenceLi, Wu, et al., 2002Li, Wu, et al., 2002Figueiredo, Miguel, et al., 2001Weyerstahl, Marschall, et al., 2000Weyerstahl, Marschall, et al., 2000, 2
Comment MSDC-RI MSDC-RI MSDC-RI MSDC-RI MSDC-RI
Column type CapillaryCapillaryCapillaryCapillaryCapillary
Active phase CP Sil 5 CBDB-1CP Sil 5 CBCP Sil 5 CBPolydimethyl siloxanes
Column length (m) 25.30.25.30.
Carrier gas HeH2HeN2
Substrate
Column diameter (mm)  0.25 0.25
Phase thickness (μm) 0.390.250.39
Program not specified45C => 3C/min => 175C => 15C => 240C(10min)not specifiednot specifiednot specified
I 1644.1620.1635.1637.1634.
ReferenceWeyerstahl, Marschall, et al., 1999da Silva, Figueiredo, et al., 1998Weyerstahl, Marschall, et al., 1998Weyerstahl, Marschall, et al., 1997Zenkevich, 1997
Comment MSDC-RI MSDC-RI MSDC-RI MSDC-RI MSDC-RI
Column type Capillary
Active phase DB-1
Column length (m) 30.
Carrier gas H2
Substrate
Column diameter (mm) 0.25
Phase thickness (μm) 0.25
Program 45 0C 3 0C/min -> 175 0C 15 0C/min -> 240 0C (10 min)
I 1620.
ReferenceBarroso, Figueiredo, et al., 1996
Comment MSDC-RI

References

de Marchese, de Heluani, et al., 2007
de Marchese, M.J.A.; de Heluani, C.S.; Catalán, C.A.N.; Griffin, C.A.; Vaughn, J.B., Jr.; Herz, W., Incisol, an alcohol with a novel sesquiterpene skeleton from Xenophyllum incisum, Biochem. Syst. Ecol., 2007, 35, 3, 169-175, https://doi.org/10.1016/j.bse.2006.10.006 . [all data]

Lima, Barros, et al., 2005
Lima, M.A.S.; Barros, M.C.P.; Pinheiro, S.M.; do Nascimento, R.F.; de Abreu Matos, F.J.; Silveira, E.R., Volatile compositions of two Asteraceae from the north-east of Brazil: Ageratum conyzoides and Acritopappus confertus (Eupatorieae), Flavour Fragr. J., 2005, 20, 6, 559-561, https://doi.org/10.1002/ffj.1483 . [all data]

Tuberoso, Kowalczyk, et al., 2005
Tuberoso, C.I.G.; Kowalczyk, A.; Coroneo, V.; Russo, M.T.; Dessì, S.; Cabras, P., Chemical Composition and Antioxidant, Antimicrobial, and Antifungal Activities of the Essential Oil of Achillea ligustica All., J. Agric. Food Chem., 2005, 53, 26, 10148-10153, https://doi.org/10.1021/jf0518913 . [all data]

El-Shazly, Dorai, et al., 2002
El-Shazly, A.; Dorai, G.; Wink, M., Composition and antimicrobial activity of essential oil and hexane-ether extract of Tanacetum santolinoides (DC.) Feinbr. and Fertig, Z. Naturforsch., 2002, 57c, 620-623. [all data]

Rao, Rout, et al., 2000
Rao, Y.R.; Rout, P.K.; Jena, K.S.; Sahu, S.B., Composition of essential oil of citronella (Cymbopogon winterianus jowitt) grown in coastal Orissa, Fafai J., 2000, 2, 4, 29-31. [all data]