Naphthalene, 1,2,3,4,4a,5,6,8a-octahydro-4a,8-dimethyl-2-(1-methylethenyl)-, [2R-(2α,4aα,8aβ)]-

Kovats' RI, non-polar column, temperature ramp

Data compiled by: NIST Mass Spectrometry Data Center, William E. Wallace, director

Column type CapillaryCapillaryCapillaryCapillaryCapillary
Active phase DB-5MSDB-5MSDB-1BP-1SPB-1
Column length (m) 30.30.25.30.30.
Carrier gas HeHeHeN2He
Substrate
Column diameter (mm) 0.250.250.20.320.32
Phase thickness (μm) 0.250.25 0.250.25
Tstart (C) 60.60.60.60.60.
Tend (C) 180.280.220.220.240.
Heat rate (K/min) 3.3.3.5.4.
Initial hold (min)   3. 4.
Final hold (min) 15.30. 3.2.
I 1505.1463.1501.1497.1498.
ReferenceAngioni, Barra, et al., 2006Marongiu, Porcedda, et al., 2006Mevy, Bessiere, et al., 2006Srivastava, Srivastava, et al., 2006Walde, Jyothirmayi, et al., 2006
Comment MSDC-RI MSDC-RI MSDC-RI MSDC-RI MSDC-RI
Column type CapillaryCapillaryCapillaryCapillaryCapillary
Active phase DB-5MSDB-5CP Sil 5 CBHP-5MSDB-5
Column length (m) 30. 25.30.30.
Carrier gas He H2HeHe
Substrate
Column diameter (mm) 0.25 0.250.250.25
Phase thickness (μm) 0.25 0.150.250.25
Tstart (C) 60.60.50.60.60.
Tend (C) 240.240.230.280.240.
Heat rate (K/min) 3.3.3.3.3.
Initial hold (min)
Final hold (min)     30.
I 1496.1494.1499.1475.1480.
ReferenceMaia, Andrade, et al., 2005Shatar S., 2005Ogunwande, Olawore, et al., 2004Couladis, Chinou, et al., 2003Marongiu, Piras, et al., 2003
Comment MSDC-RI MSDC-RI MSDC-RI MSDC-RI MSDC-RI
Column type CapillaryCapillaryCapillaryCapillaryCapillary
Active phase CP Sil 5 CBHP-5DB-5HP-5BP-1
Column length (m) 25.30.30.30.60.
Carrier gas HeHeHeHeN2
Substrate
Column diameter (mm) 0.250.250.250.250.32
Phase thickness (μm) 0.150.250.250.250.25
Tstart (C) 50.60.50.60.60.
Tend (C) 230.280.250.200.220.
Heat rate (K/min) 3.3.0.54.5.
Initial hold (min)   5.1.
Final hold (min)   10.15.
I 1496.1483.1497.1496.1490.
ReferenceOgunwande, Olawore, et al., 2003Özcan, Tzakou, et al., 2003Viña and Murillo, 2003Juliani and Simon, 2002Raina, Lal, et al., 2002
Comment MSDC-RI MSDC-RI MSDC-RI MSDC-RI MSDC-RI
Column type CapillaryCapillaryCapillaryCapillaryCapillary
Active phase BP-1BP-1Cross-Linked MethylsiliconeBP-1BP-1
Column length (m) 25.25.50.25.25.
Carrier gas N2N2HeN2N2
Substrate
Column diameter (mm) 0.320.550.20.550.55
Phase thickness (μm) 0.250.250.250.250.25
Tstart (C) 60.60.100.60.60.
Tend (C) 220.220.280.220.220.
Heat rate (K/min) 5.5.4.5.5.
Initial hold (min)
Final hold (min) 15.15. 15.15.
I 1491.1496.1487.1496.1490.
ReferenceRaina, Srivastava, et al., 2002Raina, Srivastava, et al., 2002, 2Rajeswara Rao, Kaul, et al., 2002Jain, Srivastava, et al., 2001Raina, Srivastava, et al., 2001
Comment MSDC-RI MSDC-RI MSDC-RI MSDC-RI MSDC-RI
Column type CapillaryCapillaryCapillaryCapillaryCapillary
Active phase HP-1DB-1BP-1HP-5MSHP-5MS
Column length (m) 25.30.25.30.30.
Carrier gas HeHeN2HeHe
Substrate
Column diameter (mm) 0.20.250.500.250.32
Phase thickness (μm) 0.250.250.250.250.25
Tstart (C) 100.40.60.60.70.
Tend (C) 220.260.220.280.250.
Heat rate (K/min) 4.2.5.3.3.
Initial hold (min)  5.  5.
Final hold (min)  20.10.
I 1484.1479.1486.1494.1488.
ReferenceRajeswara Rao, 2001Senatore and Rigano, 2001Rao, Sastry, et al., 2000Roussis, Tsoukatou, et al., 2000Siani, Ramos, et al., 1999
Comment MSDC-RI MSDC-RI MSDC-RI MSDC-RI MSDC-RI
Column type CapillaryCapillaryCapillaryCapillaryCapillary
Active phase Methyl SiliconeDB-5SE-30DB-5DB-5
Column length (m) 25.30.25.30.30.
Carrier gas N2HeN2
Substrate
Column diameter (mm) 0.50.250.2
Phase thickness (μm)  0.25
Tstart (C) 60.40.60.40.40.
Tend (C) 220.250.180.210.210.
Heat rate (K/min) 5.2.3.2.2.
Initial hold (min)  5.10.2.2.
Final hold (min)  20.1.120.120.
I 1484.1478.1492.1495.1497.
ReferenceMallavarapu, Rao, et al., 1998Senatore, Urrunaga Soria, et al., 1998Jantan, Ali, et al., 1995Loayza, Abujder, et al., 1995Loayza, Abujder, et al., 1995
Comment MSDC-RI MSDC-RI MSDC-RI MSDC-RI MSDC-RI
Column type CapillaryCapillary
Active phase HP-1SPB-1
Column length (m) 15.50.
Carrier gas  He
Substrate
Column diameter (mm) 0.320.20
Phase thickness (μm)
Tstart (C) 40.35.
Tend (C) 240.200.
Heat rate (K/min) 6.3.
Initial hold (min)  5.
Final hold (min) 10.20.
I 1482.1510.
ReferenceRaharivelomanana, Cambon, et al., 1993Wong and Tie, 1993
Comment MSDC-RI MSDC-RI

Kovats' RI, polar column, temperature ramp

Data compiled by: NIST Mass Spectrometry Data Center, William E. Wallace, director

Column type CapillaryCapillaryCapillaryCapillaryCapillary
Active phase InnowaxSupelcowax-10Supelcowax-10Supelcowax-10Supelcowax-10
Column length (m) 30.30.30.30.60.
Carrier gas He   He
Substrate
Column diameter (mm) 0.25   0.25
Phase thickness (μm) 0.25
Tstart (C) 50.40.40.40.35.
Tend (C) 250.210.210.210.200.
Heat rate (K/min) 0.52.2.2.3.
Initial hold (min) 5.2.2.2.5.
Final hold (min) 10.120.120.120.20.
I 1722.1704.1705.1718.1748.
ReferenceViña and Murillo, 2003Loayza, Abujder, et al., 1995Loayza, Abujder, et al., 1995Loayza, Abujder, et al., 1995Wong and Tie, 1993
Comment MSDC-RI MSDC-RI MSDC-RI MSDC-RI MSDC-RI
Column type Capillary
Active phase Carbowax 20M
Column length (m) 50.
Carrier gas He
Substrate
Column diameter (mm) 0.3
Phase thickness (μm)
Tstart (C) 70.
Tend (C) 210.
Heat rate (K/min) 2.
Initial hold (min)
Final hold (min)
I 1701.
ReferenceRandriamiharisoa and Gaydou, 1987
Comment MSDC-RI

Normal alkane RI, non-polar column, temperature ramp

Data compiled by: NIST Mass Spectrometry Data Center, William E. Wallace, director

Column type CapillaryCapillaryCapillaryCapillaryCapillary
Active phase HP-5 MSDB-5 MSHP-5 MSDB-5Elite-5 MS
Column length (m) 60.30.30.30.30.
Carrier gas HeliumHeliumHeliumHeliumHelium
Substrate
Column diameter (mm) 0.250.250.250.250.25
Phase thickness (μm) 0.250.250.250.250.25
Tstart (C) 40.60.60.60.40.
Tend (C) 250.270.220.240.220.
Heat rate (K/min) 3.3.4.3.4.
Initial hold (min) 1. 20.
Final hold (min) 20. 20.
I 1491.1497.1492.1494.1484.
ReferenceSardashti, Valizadeh, et al., 2013Cui, Yang, et al., 2011Feizbakhsh and Naeemy, 2011Karimi, Farmani, et al., 2011Baharum, Bunawan, et al., 2010
Comment MSDC-RI MSDC-RI MSDC-RI MSDC-RI MSDC-RI
Column type CapillaryCapillaryCapillaryCapillaryCapillary
Active phase HP-5DB-5HP-5 MSHP-5 MSHP-5 MS
Column length (m) 30.30.30.30.30.
Carrier gas HeliumHeliumHeliumHeliumHelium
Substrate
Column diameter (mm) 0.250.250.250.250.25
Phase thickness (μm) 0.250.250.250.250.25
Tstart (C) 50.60.60.70.70.
Tend (C) 300.240.220.290.290.
Heat rate (K/min) 50.3.5.5.5.
Initial hold (min) 5. 10.
Final hold (min) 5.  10.10.
I 1493.1492.1498.1503.1494.
ReferenceBi Kouame, Bedi, et al., 2010Magalhaes, Lima, et al., 2010Ogunwande, Flamini, et al., 2010Radulovic, Blagojevic, et al., 2010Radulovic, Dordevic, et al., 2010
Comment MSDC-RI MSDC-RI MSDC-RI MSDC-RI MSDC-RI
Column type CapillaryCapillaryCapillaryCapillaryCapillary
Active phase SLB-5 MSSLB-5 MSDB-5DB-5SE-54
Column length (m) 10.10.30.30.30.
Carrier gas HeliumHeliumHeliumHeliumHelium
Substrate
Column diameter (mm) 0.100.100.250.250.25
Phase thickness (μm) 0.100.100.250.250.25
Tstart (C) 50.50.40.40.60.
Tend (C) 250.250.240.250.260.
Heat rate (K/min) 10.10.3.10.2.
Initial hold (min)   1.1.5.
Final hold (min)    3.999.
I 1491.1500.1501.1490.1487.
ReferenceScandinaro, Tranchida, et al., 2010Scandinaro, Tranchida, et al., 2010de Souza, Lopes, et al., 2010Yang, Zhang, et al., 2010Dayisoylu and Alma, 2009
Comment MSDC-RI MSDC-RI MSDC-RI MSDC-RI MSDC-RI
Column type CapillaryCapillaryCapillaryCapillaryCapillary
Active phase SPB-5CP-Sil 5 CBDB-5HP-5 MSHP-5
Column length (m) 60.30.30.30.30.
Carrier gas NitrogenNitrogenHeliumHeliumHelium
Substrate
Column diameter (mm) 0.350.250.250.250.32
Phase thickness (μm) 0.250.250.250.250.25
Tstart (C) 60.50.50.35.50.
Tend (C) 230.200.250.195.280.
Heat rate (K/min) 4.5.5.2.5.
Initial hold (min)   2.5.2.
Final hold (min) 40.  30.5.
I 1514.1506.1498.1489.1494.
ReferenceGauvin-Bialecki and Marodon, 2009Hnawia, Menut, et al., 2009Ho, Wang, et al., 2009Kim and Chung, 2009Lago, Favero, et al., 2009
Comment MSDC-RI MSDC-RI MSDC-RI MSDC-RI MSDC-RI
Column type CapillaryCapillaryCapillaryCapillaryCapillary
Active phase DB-55 % Phenyl methyl siloxaneDB-5DB-5 MSDB-5
Column length (m) 30.60.30.30.30.
Carrier gas HeliumHeliumNitrogenHeliumHelium
Substrate
Column diameter (mm) 0.250.250.250.250.25
Phase thickness (μm) 0.250.250.250.250.25
Tstart (C) 70.90.40.50.40.
Tend (C) 240.225.230.220.240.
Heat rate (K/min) 5.3.2.3.3.
Initial hold (min)    2.1.
Final hold (min)  3. 70.
I 1491.1499.1498.1485.1501.
ReferenceLawal and Oyedelji, 2009Retta, Gattuso, et al., 2009Scrivanti, Anton, et al., 2009Shimizu, Imayoshi, et al., 2009de Souza, Lopes, et al., 2009
Comment MSDC-RI MSDC-RI MSDC-RI MSDC-RI MSDC-RI
Column type CapillaryCapillaryCapillaryCapillaryCapillary
Active phase HP-1HP-5 MSDB-5ZB-1DB-5 MS
Column length (m) 25.30.30.30.30.
Carrier gas  HeliumHeliumNitrogenHelium
Substrate
Column diameter (mm) 0.320.250.250.250.25
Phase thickness (μm) 0.170.250.250.250.25
Tstart (C) 50.50.100.45.50.
Tend (C) 260.280.300.230.300.
Heat rate (K/min) 1.4.20.3.5.
Initial hold (min) 5. 2. 5.
Final hold (min) 5. 10. 5.
I 1489.1496.1470.1478.1498.
ReferenceWetwiayaklung, Thavanapong, et al., 2009Zhao, Zeng, et al., 2009Khokra, Prakash, et al., 2008Mierendorff, Stahl-Biskup, et al., 2008Noudogbessi, Yedomonhan, et al., 2008
Comment MSDC-RI MSDC-RI MSDC-RI MSDC-RI MSDC-RI
Column type CapillaryCapillaryCapillaryCapillaryCapillary
Active phase HP-5CP Sil 5 CBHP-5 MSDB-5MSZB-5
Column length (m) 30.30.30.30.30.
Carrier gas HeliumN2HeliumHe
Substrate
Column diameter (mm) 0.250.320.320.250.25
Phase thickness (μm) 0.320.250.250.250.25
Tstart (C) 60.60.60.60.60.
Tend (C) 250.300.280.240.220.
Heat rate (K/min) 5.4.4.3.4.
Initial hold (min) 30. 5. 5.
Final hold (min)     20.
I 1494.1494.1497.1497.1497.
ReferenceYassa and Akhani, 2008Baran, von Reuss, et al., 2007Capetanos, Saroglou, et al., 2007Da Silva J.K.R., Sousa P.J.C., et al., 2007Mohottalage, Tabacchi, et al., 2007
Comment MSDC-RI MSDC-RI MSDC-RI MSDC-RI MSDC-RI
Column type CapillaryCapillaryCapillaryCapillaryCapillary
Active phase DB-1Methyl SiliconeDB-1SPB-1HP-5 MS
Column length (m) 30.50.50.30.30.
Carrier gas  HeliumHeHeHelium
Substrate
Column diameter (mm) 0.250.250.250.20.25
Phase thickness (μm) 0.15 0.250.20.25
Tstart (C) 60.50.95.70.60.
Tend (C) 220.240.240.220.280.
Heat rate (K/min) 3.3.4.3.3.
Initial hold (min)
Final hold (min)    15.
I 1488.1498.1492.1479.1498.
ReferenceOuattara, Koudou, et al., 2007Ozcan and Chalchat, 2007Pala-Paul, Brophy, et al., 2007Pinto, Salgueiro, et al., 2007Vagionas, Graikou, et al., 2007
Comment MSDC-RI MSDC-RI MSDC-RI MSDC-RI MSDC-RI
Column type CapillaryCapillaryCapillaryCapillaryCapillary
Active phase HP-5MSHP-5AT-5BP-1HP-5MS
Column length (m) 30.30.60.50.30.
Carrier gas HeHeHe He
Substrate
Column diameter (mm) 0.250.250.250.220.25
Phase thickness (μm) 0.250.320.250.250.25
Tstart (C) 40.60.60.60.60.
Tend (C) 250.250.200.220.280.
Heat rate (K/min) 3.5.4.2.3.
Initial hold (min) 5.30.
Final hold (min) 10. 20.20.
I 1470.1494.1494.1494.1495.
ReferenceVichi, Riu-Aumatell, et al., 2007Yassa and Akhani, 2007Borges, Rojas, et al., 2006Boti, Yao, et al., 2006Bozin, Mimicá-Dukic, et al., 2006
Comment MSDC-RI MSDC-RI MSDC-RI MSDC-RI MSDC-RI
Column type CapillaryCapillaryCapillaryCapillaryCapillary
Active phase HP-1HP-1HP-1HP-1HP-1
Column length (m) 50.50.50.50.50.
Carrier gas HeHeHeHeHe
Substrate
Column diameter (mm) 0.20.20.20.20.2
Phase thickness (μm) 0.330.330.50.330.33
Tstart (C) 60.60.60.60.60.
Tend (C) 250.250.250.250.250.
Heat rate (K/min) 2.2.2.2.2.
Initial hold (min) 4.4. 4.
Final hold (min) 30.30.120.30.60.
I 1488.1499.1488.1488.1494.
ReferenceCastel, Fernandez, et al., 2006Castel, Fernandez, et al., 2006Castel, Fernandez, et al., 2006, 2Castel, Fernandez, et al., 2006, 2Fernandez, Pintaric, et al., 2006
Comment MSDC-RI MSDC-RI MSDC-RI MSDC-RI MSDC-RI
Column type CapillaryCapillaryCapillaryCapillaryCapillary
Active phase DB-5DB-5DB-5Ultra-2HP-5
Column length (m) 30.30.30.50.25.
Carrier gas HeHeHeliumHeN2
Substrate
Column diameter (mm) 0.250.250.250.250.2
Phase thickness (μm) 0.250.250.250.320.33
Tstart (C) 60.60.60.50.30.
Tend (C) 240.240.260.270.280.
Heat rate (K/min) 5.5.3.2.3.
Initial hold (min) 2.2.
Final hold (min)
I 1494.1494.1491.1505.1505.
ReferenceGohari, Hadjiakhoondi, et al., 2006Gohari A.R., Hadjiakhoondi A., et al., 2006Javidnia, Miri, et al., 2006Schlumpberger B.O., Clery R.A., et al., 2006Shafi, Jose, et al., 2006
Comment MSDC-RI MSDC-RI MSDC-RI MSDC-RI MSDC-RI
Column type CapillaryCapillaryCapillaryCapillaryCapillary
Active phase SPB-1SPB-1ZB-5DB-1DB-1
Column length (m) 50.30.60.30.60.
Carrier gas HeHeHeHeN2
Substrate
Column diameter (mm) 0.20.250.250.250.25
Phase thickness (μm) 0.330.250.250.250.25
Tstart (C) 50.50.40.60.60.
Tend (C) 220.250.250.250.250.
Heat rate (K/min) 4.4.6.5.5.
Initial hold (min) 1.1.7.5.
Final hold (min) 10.10.1.15.10.
I 1486.1475.1521.1500.1504.
ReferenceWong, Lim, et al., 2006Wong, Sivasothy, et al., 2006Dötterl, Wolfe, et al., 2005Facundo, Pinto, et al., 2005Fakhari A.R., Sonboli A., et al., 2005
Comment MSDC-RI MSDC-RI MSDC-RI MSDC-RI MSDC-RI
Column type CapillaryCapillaryCapillaryCapillaryCapillary
Active phase DB-5HP-5MSHP-5MSDB-5MSDB-1
Column length (m) 30.30.25.30.50.
Carrier gas HeHeHeHeN2
Substrate
Column diameter (mm) 0.250.250.250.250.25
Phase thickness (μm) 0.250.25 0.250.25
Tstart (C) 60.60.50.60.95.
Tend (C) 300.200.250.280.240.
Heat rate (K/min) 3.4.3.3.4.
Initial hold (min) 3.30.3.30.
Final hold (min)   10.
I 1486.1487.1493.1470.1492.
ReferenceFerraz, Limberger, et al., 2005Gauvin and Smadja, 2005Ghasemi Y., Faridi P., et al., 2005Marongiu, Piras, et al., 2005Palá-Paúl, Pérez-Alonso, et al., 2005
Comment MSDC-RI MSDC-RI MSDC-RI MSDC-RI MSDC-RI
Column type CapillaryCapillaryCapillaryCapillaryCapillary
Active phase DB-5HP-5MSDB-5DB-5DB-5
Column length (m) 30.30.30.30.30.
Carrier gas HeHeHeHeHe
Substrate
Column diameter (mm) 0.250.250.250.250.25
Phase thickness (μm) 0.250.250.250.250.25
Tstart (C) 40.60.60.60.60.
Tend (C) 260.280.300.300.300.
Heat rate (K/min) 2.3.3.3.3.
Initial hold (min) 5.5.
Final hold (min) 20.
I 1494.1495.1488.1488.1488.
ReferenceSenatore, Apostolides Arnold, et al., 2005Setzer, Noletto, et al., 2005Simoes-Pires C.A., Debenedetti S., et al., 2005Simoes-Pires C.A., Debenedetti S., et al., 2005Simoes-Pires C.A., Debenedetti S., et al., 2005
Comment MSDC-RI MSDC-RI MSDC-RI MSDC-RI MSDC-RI
Column type CapillaryCapillaryCapillaryCapillaryCapillary
Active phase BP-1CP Sil 8 CBHP-5 MSHP-5MSDB-5MS
Column length (m) 30.30.30.30.30.
Carrier gas N2HeHe He
Substrate
Column diameter (mm) 0.320.250.250.250.25
Phase thickness (μm) 0.25 0.500.250.25
Tstart (C) 60.60.60.40.80.
Tend (C) 220.290.260.220.250.
Heat rate (K/min) 5.3.3.3.5.
Initial hold (min)  5. 5.2.
Final hold (min) 15. 20.10.9.
I 1492.1514.1487.1470.1495.
ReferenceSrivastava, Srivastava, et al., 2005Suárez, Vásquez, et al., 2005Topçu, Barla, et al., 2005Vichi, Riu-Aumatell, et al., 2005Watanabe Y., Mihara R., et al., 2005
Comment MSDC-RI MSDC-RI MSDC-RI MSDC-RI MSDC-RI
Column type CapillaryCapillaryCapillaryCapillaryCapillary
Active phase DB-5CP Sil 5 CBDB-1DB-5MSDB-5
Column length (m) 30.30.30.30.30.
Carrier gas H2N2N2HeHe
Substrate
Column diameter (mm) 0.250.250.250.250.25
Phase thickness (μm) 0.250.250.250.250.25
Tstart (C) 50.50.50.60.60.
Tend (C) 290.200.200.240.300.
Heat rate (K/min) 4.5.5.3.3.
Initial hold (min)
Final hold (min)
I 1493.1492.1495.1494.1481.
ReferenceAbreu, Reis, et al., 2004Agnaniet, Menut, et al., 2004Fekam Boyom, Fotio, et al., 2004paz Lima, Silva, et al., 2004Limberger, Sobral, et al., 2004
Comment MSDC-RI MSDC-RI MSDC-RI MSDC-RI MSDC-RI
Column type CapillaryCapillaryCapillaryCapillaryCapillary
Active phase DB-5DB-5DB-5NB-30NB-30
Column length (m) 30.30.50.50.50.
Carrier gas  HeliumHeliumHeHe
Substrate
Column diameter (mm) 0.250.250.250.20.2
Phase thickness (μm) 0.15  0.250.25
Tstart (C) 60.60.60.50.50.
Tend (C) 220.240.240.250.250.
Heat rate (K/min) 3.2.2.2.2.
Initial hold (min) 3.
Final hold (min)  999.999.
I 1490.1488.1488.1493.1492.
ReferenceMevy, Bessiere, et al., 2004Miyazawa, Fuhita, et al., 2004Miyazawa, Fujita, et al., 2004Orav, Stulova, et al., 2004Orav, Stulova, et al., 2004
Comment MSDC-RI MSDC-RI MSDC-RI MSDC-RI MSDC-RI
Column type CapillaryCapillaryCapillaryCapillaryCapillary
Active phase DB-1HP-5HP-5HP-5MSDB-1
Column length (m) 50.25.30.30.30.
Carrier gas N2H2N2HeN2
Substrate
Column diameter (mm) 0.250.320.250.250.25
Phase thickness (μm) 0.250.520.250.250.25
Tstart (C) 95.40.60.60.50.
Tend (C) 240.240.220.280.200.
Heat rate (K/min) 4.4.5.3.5.
Initial hold (min)   10.
Final hold (min)
I 1469.1498.1484.1492.1501.
ReferencePalá-Paúl, Velasco-Negueruela, et al., 2004Simic, Sokovic, et al., 2004Bertoli, Menichini, et al., 2003Couladis, Özcan, et al., 2003Fekam Boyom, Ngouana, et al., 2003
Comment MSDC-RI MSDC-RI MSDC-RI MSDC-RI MSDC-RI
Column type CapillaryCapillaryCapillaryCapillaryCapillary
Active phase RSL-200RSL-200DB-5DB-1DB-5MS
Column length (m) 30.30.30.30.30.
Carrier gas H2H2HeN2He
Substrate
Column diameter (mm) 0.320.320.250.250.25
Phase thickness (μm) 0.250.250.250.250.25
Tstart (C) 40.40.60.80.60.
Tend (C) 280.280.250.250.240.
Heat rate (K/min) 6.6.3.4.3.
Initial hold (min) 5.5.
Final hold (min) 5.5.
I 1492.1491.1490.1473.1493.
ReferenceJirovetz, Buchbauer, et al., 2003Jirovetz, Buchbauer, et al., 2003, 2Limberger, Simões-Pires, et al., 2003Mahalwal and Ali, 2003Maia, Taveira, et al., 2003
Comment MSDC-RI MSDC-RI MSDC-RI MSDC-RI MSDC-RI
Column type CapillaryCapillaryCapillaryCapillaryCapillary
Active phase DB-5DB-5DB-1HP-5DB-1
Column length (m) 30.30.60.30.60.
Carrier gas HeHeHeHeHe
Substrate
Column diameter (mm) 0.250.250.250.250.25
Phase thickness (μm) 0.250.250.250.250.25
Tstart (C) 60.60.50.60.40.
Tend (C) 280.280.270.280.260.
Heat rate (K/min) 3.3.4.3.4.
Initial hold (min)     5.
Final hold (min) 30.30.
I 1487.1485.1475.1476.1473.
ReferenceMarongiu, Porcedda, et al., 2003Marongiu, Porcedda, et al., 2003Mirza and Nik, 2003Pitarokili, Tzakou, et al., 2003Sefidkon, Naderi Nik, et al., 2003
Comment MSDC-RI MSDC-RI MSDC-RI MSDC-RI MSDC-RI
Column type CapillaryCapillaryCapillaryCapillaryCapillary
Active phase DB-1DB-5DB-5MSHP-5DB-5
Column length (m) 60.30.30.30.30.
Carrier gas HeHeHeHeHe
Substrate
Column diameter (mm) 0.250.250.250.250.25
Phase thickness (μm) 0.250.250.250.320.25
Tstart (C) 50.60.60.60.60.
Tend (C) 280.240.240.250.240.
Heat rate (K/min) 4.3.3.5.3.
Initial hold (min)    30.
Final hold (min)
I 1489.1494.1492.1494.1496.
ReferenceShahmir, Ahmadi, et al., 2003da Silva, Luz, et al., 2003Taveira, de Lima, et al., 2003Yassa, Akhani, et al., 2003Zoghbi, Andrade, et al., 2003
Comment MSDC-RI MSDC-RI MSDC-RI MSDC-RI MSDC-RI
Column type CapillaryCapillaryCapillaryCapillaryCapillary
Active phase DB-5MSDB-5DB-1MDN-5DB-5
Column length (m) 30.30.30.30.30.
Carrier gas HeN2H2 He
Substrate
Column diameter (mm) 0.250.250.320.250.25
Phase thickness (μm) 0.250.250.250.250.25
Tstart (C) 60.50.40.40.60.
Tend (C) 280.250.245.280.240.
Heat rate (K/min) 3.4.3.8.3.
Initial hold (min)   20.3.
Final hold (min)
I 1496.1494.1468.1489.1494.
ReferenceCongiu, Falconieri, et al., 2002Farah, Fechtal, et al., 2002Gancel, Ollé, et al., 2002Jelén, 2002Kobaisy, Tellez, et al., 2002
Comment MSDC-RI MSDC-RI MSDC-RI MSDC-RI MSDC-RI
Column type CapillaryCapillaryCapillaryCapillaryCapillary
Active phase RTX-5DB-5OV-101DB-5DB-5MS
Column length (m) 30.30.25.30.30.
Carrier gas HeHeHeHeHe
Substrate
Column diameter (mm) 0.250.250.320.250.25
Phase thickness (μm) 0.250.25 0.250.25
Tstart (C) 60.35.50.60.60.
Tend (C) 150.280.200.240.240.
Heat rate (K/min) 1.3.5.3.3.
Initial hold (min) 3.2.
Final hold (min)  15.
I 1483.1505.1481.1493.1496.
ReferenceKovacevic and Kac, 2002Krauze-Baranowska, Mardarowicz, et al., 2002Kuiate, Bessière, et al., 2002Maia, da Silva, et al., 2002Maia, Zoghbi, et al., 2002
Comment MSDC-RI MSDC-RI MSDC-RI MSDC-RI MSDC-RI
Column type CapillaryCapillaryCapillaryCapillaryCapillary
Active phase DB-5DB-5DB-5MSDB-5BP-1
Column length (m) 30.25.30.30.30.
Carrier gas HeHeHeHeN2
Substrate
Column diameter (mm) 0.250.20.250.250.25
Phase thickness (μm) 0.25 0.250.250.25
Tstart (C) 60.60.60.60.60.
Tend (C) 300.220.270.240.220.
Heat rate (K/min) 2.3.3.3.5.
Initial hold (min)
Final hold (min)
I 1484.1499.1493.1495.1486.
ReferenceRuberto, Biondi, et al., 2002Schwob, Bessière, et al., 2002Zoghbi, Andrade, et al., 2002Zoghbi, Andrade, et al., 2002, 2Gupta, Mallavarapu, et al., 2001
Comment MSDC-RI MSDC-RI MSDC-RI MSDC-RI MSDC-RI
Column type CapillaryCapillaryCapillaryCapillaryCapillary
Active phase RSL-200HP-1RTX-5DB-5MSDB-5
Column length (m) 30.25.30.30.30.
Carrier gas H2N2HeHeHe
Substrate
Column diameter (mm) 0.320.20.250.250.25
Phase thickness (μm) 0.250.110.250.250.25
Tstart (C) 40.60.60.60.60.
Tend (C) 280.190.150.240.270.
Heat rate (K/min) 6.2.51.3.3.
Initial hold (min) 5.3.3.
Final hold (min) 5.1. 30.
I 1509.1476.1483.1481.1496.
ReferenceJirovetz L., Buchbauer G., et al., 2001Kovacevic and Kac, 2001Kovacevic and Kac, 2001Marongiu, Porcedda, et al., 2001Palmeira, Conserva, et al., 2001
Comment MSDC-RI MSDC-RI MSDC-RI MSDC-RI MSDC-RI
Column type CapillaryCapillaryCapillaryCapillaryCapillary
Active phase DB-1DB-5CP Sil 5 CBCP Sil 5 CBDB-1
Column length (m) 30.30.25.25.33.
Carrier gas N2H2 HeN2
Substrate
Column diameter (mm) 0.250.250.250.250.25
Phase thickness (μm) 0.250.250.150.40.50
Tstart (C) 80.60.50.60.50.
Tend (C) 225.285.230.260.135.
Heat rate (K/min) 4.3.3.5.20.
Initial hold (min)    40.2.
Final hold (min)
I 1464.1491.1479.1491.1506.
ReferencePalá-Paúl, Pérez-Alonso, et al., 2001Santos-Gomes and Fernandes-Ferreira, 2001Asekun and Ekundayo, 2000Baser, Özek, et al., 2000Feger, Brandauer, et al., 2000
Comment MSDC-RI MSDC-RI MSDC-RI MSDC-RI MSDC-RI
Column type CapillaryCapillaryCapillaryCapillaryCapillary
Active phase DB-5DB-1OV-101DB-5DB-5MS
Column length (m) 30.25.50.30.30.
Carrier gas HeNitrogenNitrogenHeHe
Substrate
Column diameter (mm) 0.250.500.250.250.25
Phase thickness (μm) 0.250.25 0.250.25
Tstart (C) 60.60.40.60.60.
Tend (C) 240.220.200.240.240.
Heat rate (K/min) 3.5.2.3.3.
Initial hold (min)   10.
Final hold (min)
I 1492.1495.1490.1494.1485.
ReferenceMaia, Zoghbi, et al., 2000Mallavarapu, Rao, et al., 2000Tamura, Boonbumrung, et al., 2000Tellez, Dayan, et al., 2000Zoghbi, Andrade, et al., 1999
Comment MSDC-RI MSDC-RI MSDC-RI MSDC-RI MSDC-RI
Column type CapillaryCapillaryCapillaryCapillaryCapillary
Active phase DB-5HP-1OV-101DB-5DB-5
Column length (m) 30.60.25.30.30.
Carrier gas HeliumHe HeHe
Substrate
Column diameter (mm) 0.250.250.320.250.25
Phase thickness (μm) 0.250.25 0.25
Tstart (C) 60.50.50.65.60.
Tend (C) 240.280.200.300.240.
Heat rate (K/min) 3.4.5.4.4.
Initial hold (min)  5. 2.
Final hold (min)
I 1496.1512.1492.1481.1497.
ReferenceSantos, Andrade, et al., 1998Stashenko, Cervantes, et al., 1998Zollo, Biyiti, et al., 1998Elias, Simoneit, et al., 1997Zunino, Novillo-Newton, et al., 1997
Comment MSDC-RI MSDC-RI MSDC-RI MSDC-RI MSDC-RI
Column type CapillaryCapillaryCapillaryCapillaryCapillary
Active phase DB-5SPB-1HP-5Methyl SiliconeMethyl Silicone
Column length (m) 30.50. 50.50.
Carrier gas  He N2N2
Substrate
Column diameter (mm) 0.250.2 0.250.25
Phase thickness (μm) 0.250.33 0.170.17
Tstart (C) 60.40.35.80.80.
Tend (C) 300.200.200.200.200.
Heat rate (K/min) 4.3.6.2.3.
Initial hold (min) 2.3.2.
Final hold (min) 5.30.
I 1491.61495.1534.1484.1483.
ReferenceGawdzik, Mardarowicz, et al., 1996Wong and Lai, 1996Larsen and Frisvad, 1995Gopalakrishnan, Menon, et al., 1993Gopalakrishnan, Menon, et al., 1993
Comment MSDC-RI MSDC-RI MSDC-RI MSDC-RI MSDC-RI
Column type CapillaryCapillaryCapillaryCapillaryCapillary
Active phase SE-54CP Sil 8 CBDB-1DB-1SE-30
Column length (m) 30.25.60.60.30.
Carrier gas Hydrogen HeHe
Substrate
Column diameter (mm) 0.250.200.320.32
Phase thickness (μm) 0.25
Tstart (C) 60.60.30.30.50.
Tend (C) 250.230.210.210.240.
Heat rate (K/min) 2.3.2.2.4.
Initial hold (min) 5.10.4.4.2.
Final hold (min) 2.   10.
I 1487.1529.1482.1489.1484.
ReferenceKollmannsberger, Nitz, et al., 1992Jantan and Goh, 1990Takeoka and Butter, 1989Takeoka and Butter, 1989Ramaswami, Briscese, et al., 1988
Comment MSDC-RI MSDC-RI MSDC-RI MSDC-RI MSDC-RI
Column type Capillary
Active phase SE-30
Column length (m) 30.
Carrier gas
Substrate
Column diameter (mm)
Phase thickness (μm)
Tstart (C) 50.
Tend (C) 240.
Heat rate (K/min) 4.
Initial hold (min) 2.
Final hold (min) 10.
I 1484.
ReferenceRamaswami, Briscese, et al., 1986
Comment MSDC-RI

References

Angioni, Barra, et al., 2006
Angioni, A.; Barra, A.; Coroneo, V.; Dessi, S.; Cabras, P., Chemical composition, seasonal variability, and antifungal activity of Lavandula stoechas L. ssp. stoechas essential oils from stem/leaves and flowers, J. Agric. Food Chem., 2006, 54, 12, 4364-4370, https://doi.org/10.1021/jf0603329 . [all data]

Marongiu, Porcedda, et al., 2006
Marongiu, B.; Porcedda, S.; Piras, A.; Sanna, G.; Murreddu, M.; Loddo, R., Extraction of Juniperus communis L. ssp. nana Willd. essential oil by supercritical carbon dioxide, Flavour Fragr. J., 2006, 21, 1, 148-154, https://doi.org/10.1002/ffj.1549 . [all data]

Mevy, Bessiere, et al., 2006
Mevy, J.P.; Bessiere, J.M.; Rabier, J.; Dherbomez, M.; Ruzzier, M.; Millogo, J.; Viano, J., Composition and antimicrobial activities of the essential oil of Triumfetta rhomboidea Jacq., Flavour Fragr. J., 2006, 21, 1, 80-83, https://doi.org/10.1002/ffj.1511 . [all data]

Srivastava, Srivastava, et al., 2006
Srivastava, A.K.; Srivastava, S.K.; Syamsundar, K.V., Volatile composition of Curcuma angustifolia Roxb. rhizome from central and southern India, Flavour Fragr. J., 2006, 21, 3, 423-426, https://doi.org/10.1002/ffj.1680 . [all data]

Walde, Jyothirmayi, et al., 2006
Walde, S.G.; Jyothirmayi, T.; Prabhakara Rao, P.G.; Srinivas, P., Flavour volatiles of flowers and stalks of Murraya koenigii L., Flavour Fragr. J., 2006, 21, 4, 581-584, https://doi.org/10.1002/ffj.1737 . [all data]

Maia, Andrade, et al., 2005
Maia, J.G.S.; Andrade, E.H.A.; da Silva, A.C.M.; Oliveira, J.; Carreira, L.M.M.; Araújo, J.S., Leaf volatile oils from four Brazilian Xylopia species, Flavour Fragr. J., 2005, 20, 5, 474-477, https://doi.org/10.1002/ffj.1499 . [all data]

Shatar S., 2005
Shatar S., Essential oil of Ferula ferulaoides from Western Mongolia, Chem. Nat. Compd. (Engl. Transl.), 2005, 41, 5, 607-608, https://doi.org/10.1007/s10600-005-0222-8 . [all data]

Ogunwande, Olawore, et al., 2004
Ogunwande, I.A.; Olawore, N.O.; Adeleke, K.A.; Ekundayo, O.; König, W.A., Rare terpenoid esters from Hyparrhenia rufa (Nees) Stapf. growing wild in Nigeria, Flavour Fragr. J., 2004, 19, 3, 239-243, https://doi.org/10.1002/ffj.1295 . [all data]

Couladis, Chinou, et al., 2003
Couladis, M.; Chinou, I.B.; Tzakou, O.; Petrakis, P.V., Composition and antimicrobial activity of the essential oil of Hypericum rumeliacum subsp. apollinis (Boiss. Heldr.), Phytother. Res., 2003, 17, 2, 152-154, https://doi.org/10.1002/ptr.1093 . [all data]

Marongiu, Piras, et al., 2003
Marongiu, B.; Piras, A.; Pani, F.; Porcedda, S.; Ballero, M., Extraction, separation and isolation of essential oils from natural matrices by supercritical CO2, Flavour Fragr. J., 2003, 18, 6, 505-509, https://doi.org/10.1002/ffj.1258 . [all data]

Ogunwande, Olawore, et al., 2003
Ogunwande, I.A.; Olawore, N.O.; Adeleke, K.A.; Ekundayo, O.; Koenig, W.A., Chemical composition of the leaf volatile oil of Psidium guajava L. growing in Nigeria, Flavour Fragr. J., 2003, 18, 2, 136-138, https://doi.org/10.1002/ffj.1175 . [all data]

Özcan, Tzakou, et al., 2003
Özcan, M.; Tzakou, O.; Couladis, M., Essential oil composition of Turkish herbal tea (Salvia aucheri Bentham var. canescens Boiss. Heldr.), Flavour Fragr. J., 2003, 18, 4, 325-327, https://doi.org/10.1002/ffj.1229 . [all data]

Viña and Murillo, 2003
Viña, A.; Murillo, E., Essential oil composition from twelve varieties of basil (Ocimum spp) grown in Columbia, J. Braz. Chem. Soc., 2003, 14, 5, 744-749, https://doi.org/10.1590/S0103-50532003000500008 . [all data]

Juliani and Simon, 2002
Juliani, H.R.; Simon, J.E., Antioxidant acitivity of basil in Trends in new crops and new uses, Janick,J.; Whipkey,A., ed(s)., ASHA Press, Alexandria, Va, 2002, 575-579. [all data]

Raina, Lal, et al., 2002
Raina, V.K.; Lal, R.K.; Tripathi, S.; Khan, M.; Syamasundar, K.V.; Srivastava, S.K., Erratum. Essential oil composition of genetically diverse stocks of Murraya koenigii from India, Flavour Fragr. J., 2002, 17, 5, 404, https://doi.org/10.1002/ffj.1139 . [all data]

Raina, Srivastava, et al., 2002
Raina, V.K.; Srivastava, S.K.; Syamasunder, K.V., The essential oil of 'greater galangal' [Alpinia galanga (L.) Willd.] from the lower Himalayan region of India, Flavour Fragr. J., 2002, 17, 5, 358-360, https://doi.org/10.1002/ffj.1105 . [all data]

Raina, Srivastava, et al., 2002, 2
Raina, V.K.; Srivastava, S.K.; Jain, N.; Ahmad, A.; Syamasundar, K.V.; Aggarwal, K.K., Essential oil composition of Curcuma longa L. cv. Roma from the plains of northern India, Flavour Fragr. J., 2002, 17, 2, 99-102, https://doi.org/10.1002/ffj.1053 . [all data]

Rajeswara Rao, Kaul, et al., 2002
Rajeswara Rao, B.R.; Kaul, P.N.; Syamasundar, K.V.; Ramesh, S., Water soluble fractions of rose scented geranium (Pelargonium species) essential oil, Bioresour. Technol., 2002, 84, 3, 243-246, https://doi.org/10.1016/S0960-8524(02)00057-3 . [all data]

Jain, Srivastava, et al., 2001
Jain, N.; Srivastava, S.K.; Aggarwal, K.K.; Ramesh, S.; Kumar, S., Essential oil composition of Zanthoxylum alatum seeds from northern India, Flavour Fragr. J., 2001, 16, 6, 408-410, https://doi.org/10.1002/ffj.1024 . [all data]

Raina, Srivastava, et al., 2001
Raina, V.K.; Srivastava, S.K.; Aggarwal, K.K.; Ramesh, S.; Kumar, S., Essential oil composition of Cinnamomum zeylanicum Blume leaves from Little Andaman, India, Flavour Fragr. J., 2001, 16, 5, 374-376, https://doi.org/10.1002/ffj.1016 . [all data]

Rajeswara Rao, 2001
Rajeswara Rao, B.R., Biomass and essential oil yields of rainfed palmarosa (Cymbopogon martinii (Roxb.) Wats. var. motia Burk.) supplied with different levels of organic manure and fertilizer nitrogen in semi-arid tropical climate, Ind. Crops Prod., 2001, 14, 3, 171-178, https://doi.org/10.1016/S0926-6690(01)00081-4 . [all data]

Senatore and Rigano, 2001
Senatore, F.; Rigano, D., Essential oil of two Lippia spp. (Verbenaceae) growing wild in Guatemala, Flavour Fragr. J., 2001, 16, 3, 169-171, https://doi.org/10.1002/ffj.972 . [all data]

Rao, Sastry, et al., 2000
Rao, B.R.R.; Sastry, K.P.; Saleem, S.M.; Rao, E.V.S.P.; Syamasundar, K.V.; Ramesh, S., Volatile flower oils of three genotypes of rose-scented geranium (Pelargonium sp.), Flavour Fragr. J., 2000, 15, 2, 105-107, https://doi.org/10.1002/(SICI)1099-1026(200003/04)15:2<105::AID-FFJ875>3.0.CO;2-G . [all data]

Roussis, Tsoukatou, et al., 2000
Roussis, V.; Tsoukatou, M.; Petrakis, P.V.; Chinou, I.; Skoula, M.; Harborne, J.B., Volatile constituents of four Helichrysum species growing in Greece, Biochem. Syst. Ecol., 2000, 28, 2, 163-175, https://doi.org/10.1016/S0305-1978(99)00046-0 . [all data]

Siani, Ramos, et al., 1999
Siani, A.C.; Ramos, M.F.S.; Menezes-de-Lima, O., Jr.; Ribeiro-dos-Santos, R.; Fernadez-Ferreira, E.; Soares, R.O.A.; Rosas, E.C.; Susunaga, G.S.; Guimarães, A.C.; Zoghbi, M.G.B.; Henriques, M.G.M.O., Evaluation of anti-inflammatory-related activity of essential oils from the leaves and resin of species of Protium, J. Ethnopharmacol., 1999, 66, 1, 57-69, https://doi.org/10.1016/S0378-8741(98)00148-2 . [all data]

Mallavarapu, Rao, et al., 1998
Mallavarapu, G.R.; Rao, B.R.R.; Kaul, P.N.; Ramesh, S.; Bhattacharya, A.K., Volatile constituents of the essential oils of the seeds and the herb of palmarosa (Cymbopogon martinii (Roxb.) Wats. var. motia Burk.), Flavour Fragr. J., 1998, 13, 3, 167-169, https://doi.org/10.1002/(SICI)1099-1026(199805/06)13:3<167::AID-FFJ719>3.0.CO;2-B . [all data]

Senatore, Urrunaga Soria, et al., 1998
Senatore, F.; Urrunaga Soria, E.; Urrunaga Soria, R.; Porta, G.D.; de Feo, V., Essential oil from two peruvian Satureja species, Flavour Fragr. J., 1998, 13, 1, 1-4, https://doi.org/10.1002/(SICI)1099-1026(199801/02)13:1<1::AID-FFJ672>3.0.CO;2-4 . [all data]

Jantan, Ali, et al., 1995
Jantan, I.; Ali, N.A.M.; Ahmad, A.S.; Ahmad, A.R., Constituents of the essential oil of Leptospermum javanicum blume from peninsular Malaysia, Flavour Fragr. J., 1995, 10, 4, 255-258, https://doi.org/10.1002/ffj.2730100406 . [all data]

Loayza, Abujder, et al., 1995
Loayza, I.; Abujder, D.; Aranda, R.; Jakupovic, J.; Collin, G.; Deslauriers, H.; Jean, F.-I., Essential oils of Baccharis salicifolia, B. latifolia and B. dracunculifolia, Phytochemistry, 1995, 38, 2, 381-389, https://doi.org/10.1016/0031-9422(94)00628-7 . [all data]

Raharivelomanana, Cambon, et al., 1993
Raharivelomanana, P.; Cambon, A.; Azzaro, M.; Bianchini, J.-P.; Claude-Lafontaine, A.; George, G., Volatile Constituents of Neocallitropsis pancheri (Carriere) de Laubenfels Heartwood Extracts (Cupressaceae), J. Essent. Oil Res., 1993, 5, 6, 587-595, https://doi.org/10.1080/10412905.1993.9698289 . [all data]

Wong and Tie, 1993
Wong, K.C.; Tie, D.Y., The Essential Oil of the Leaves of Murraya koenigii Spreng., J. Essent. Oil Res., 1993, 5, 4, 371-374, https://doi.org/10.1080/10412905.1993.9698245 . [all data]