Bicyclo[3.1.1]hept-2-en-6-one, 2,7,7-trimethyl-

Kovats' RI, non-polar column, custom temperature program

Data compiled by: NIST Mass Spectrometry Data Center, William E. Wallace, director

Column type CapillaryCapillary
Active phase DB-5MSOV-1
Column length (m) 30.30.
Carrier gas HeHe
Substrate
Column diameter (mm) 0.250.25
Phase thickness (μm) 0.250.25
Program 60C(5min) => 2C/min => 140C= 5C/min => 250C(5min)44C(4min) => 3C/min => 74C => 6C/min => 134C => 12C/min => 312C
I 1121.1094.
ReferenceTuberoso, Kowalczyk, et al., 2005El-Shazly, Dorai, et al., 2002
Comment MSDC-RI MSDC-RI

References

Tuberoso, Kowalczyk, et al., 2005
Tuberoso, C.I.G.; Kowalczyk, A.; Coroneo, V.; Russo, M.T.; Dessì, S.; Cabras, P., Chemical Composition and Antioxidant, Antimicrobial, and Antifungal Activities of the Essential Oil of Achillea ligustica All., J. Agric. Food Chem., 2005, 53, 26, 10148-10153, https://doi.org/10.1021/jf0518913 . [all data]

El-Shazly, Dorai, et al., 2002
El-Shazly, A.; Dorai, G.; Wink, M., Composition and antimicrobial activity of essential oil and hexane-ether extract of Tanacetum santolinoides (DC.) Feinbr. and Fertig, Z. Naturforsch., 2002, 57c, 620-623. [all data]