cyclopentadienylide radical

Gas phase ion energetics data

Data compiled by: John E. Bartmess

Electron affinity determinations

EA (eV) Method Reference Comment
1.752 ± 0.047LPDMcDonald, Bianchina, et al., 1991

Vibrational and/or electronic energy levels

Data compiled by: Marilyn E. Jacox

State:   X

Vib.
sym.
 No.   Approximate
 type of mode
 cm-1   Med.   Method   References

1345 w N2 IR Baird, Dunkin, et al., 1981
1335 m N2 IR Baird, Dunkin, et al., 1981
1101 w N2 IR Baird, Dunkin, et al., 1981
1074 w N2 IR Baird, Dunkin, et al., 1981
922 w N2 IR Baird, Dunkin, et al., 1981
703 s N2 IR Baird, Dunkin, et al., 1981
577 w N2 IR Baird, Dunkin, et al., 1981

Additional references: Jacox, 1994, page 385

References

McDonald, Bianchina, et al., 1991
McDonald, R.N.; Bianchina, E.J.; Tung, C.C., Electron Photodetachment of Cyclopentadienylidene Anion Radical in a Flowing Afterglow Apparatus - EA and ΔH(f)-Degrees of Cyclopentadienylide, J. Am. Chem. Soc., 1991, 113, 19, 7115, https://doi.org/10.1021/ja00019a005 . [all data]

Baird, Dunkin, et al., 1981
Baird, M.S.; Dunkin, I.R.; Hacker, N.; Poliakoff, M.; Turner, J.J., Cyclopentadienylidene. A matrix isolation study exploiting photolysis with unpolarized and plane-polarized light, J. Am. Chem. Soc, 1981, 103, 17, 5190, https://doi.org/10.1021/ja00407a040 . [all data]

Jacox, 1994
Jacox, M.E., Vibrational and electronic energy levels of polyatomic transient molecules, American Chemical Society, Washington, DC, 1994, 464. [all data]