Cyclopentadecanol

Normal alkane RI, non-polar column, temperature ramp

View large format table.

Column type Active phase I Reference Comment
CapillaryHP-5 MS1987.Sadashava, Sharanappa, et al., 201030. m/0.25 mm/0.25 μm, Helium, 5. K/min; Tstart: 50. C; Tend: 240. C

References

Sadashava, Sharanappa, et al., 2010
Sadashava, C.T.; Sharanappa, P.; Remashree, A.B.; Raghu, A.V.; Udayan, P.S.; Balachandran, I., Chemical composition and antimicrobial activity of the essential oil from bark of Pittosporum dasycaulon Mig., Adv. Biol. Res., 2010, 4, 6, 301-304. [all data]