Ethanamine, N-triphenylphosphoranylidene-

Phase change data

Data compiled by: William E. Acree, Jr., James S. Chickos

Quantity Value Units Method Reference Comment
Δsub18.0 ± 2.0kcal/molN/APilcher and Skinner, 1983See also Claydon, Fowell, et al., 1960.

Gas phase ion energetics data

Data compiled as indicated in comments:
LLK - Sharon G. Lias, Rhoda D. Levin, and Sherif A. Kafafi

Ionization energy determinations

IE (eV) Method Reference Comment
7.43PEStarzewski and Dieck, 1979Vertical value; LLK

References

Pilcher and Skinner, 1983
Pilcher, G.; Skinner, H.A., Thermochemistry of organometallic compounds, 1983, 43-90, https://doi.org/10.1002/9780470771686.ch2 . [all data]

Claydon, Fowell, et al., 1960
Claydon, Ann P.; Fowell, P.A.; Mortimer, C.T., 658. Heats of formation and bond energies. Part III. Trimethylphosphine oxide, N-ethyltrimethylphosphine imine, and N-ethyltri-phenylphosphine imine, J. Chem. Soc., 1960, 3284, https://doi.org/10.1039/jr9600003284 . [all data]

Starzewski and Dieck, 1979
Starzewski, K.A.O.; Dieck, H.t., Electronic structure and reactivity. 8. Iminophosphoranes- simple ylide analogues? An investigation of quantitative and sphenomenological differences, Inorg. Chem., 1979, 18, 3307. [all data]