2,6,10-Cycloundecatrien-1-one, 2,6,9,9-tetramethyl-, (E,E,E)-

Kovats' RI, non-polar column, temperature ramp

View large format table.

Column type Active phase I Reference Comment
CapillaryDB-5MS1733.Palmeira, Moura, et al., 200430. m/0.25 mm/0.25 μm, He, 3. K/min; Tstart: 60. C; Tend: 240. C
CapillaryDB-11710.Palá-Paúl, Velasco-Negueruela, et al., 200150. m/0.25 mm/0.25 μm, N2, 4. K/min; Tstart: 80. C; Tend: 225. C

Kovats' RI, non-polar column, custom temperature program

View large format table.

Column type Active phase I Reference Comment
CapillaryHP-51732.de Marchese, de Heluani, et al., 2007He; Program: 60C(5min) => 3C/min => 100C => 1C/min => 160C => 10C/min => 240C(10min)

Van Den Dool and Kratz RI, non-polar column, temperature ramp

View large format table.

Column type Active phase I Reference Comment
CapillaryDB-51733.bin Jantan, Yassin, et al., 200330. m/0.25 mm/0.25 μm, N2, 75. C @ 10. min, 3. K/min; Tend: 230. C
CapillaryDB-51731.Nogueira, Bittrich, et al., 200130. m/0.25 mm/0.25 μm, H2, 3. K/min; Tstart: 60. C; Tend: 240. C
CapillaryUltra-11754.Richmond and Pombo-Villar, 199825. m/0.32 mm/0.52 μm, He, 15. K/min, 320. C @ 10. min; Tstart: 35. C
CapillaryUltra-11753.93Richmond and Pombo-Villar, 199725. m/0.32 mm/0.52 μm, 15. K/min, 320. C @ 10. min; Tstart: 35. C
CapillaryUltra-11727.Ahmad, Sirat, et al., 199425. m/0.32 mm/0.17 μm, He, 6. K/min; Tstart: 50. C; Tend: 320. C

Normal alkane RI, non-polar column, temperature ramp

View large format table.

Column type Active phase I Reference Comment
CapillaryDB-51731.Askari and Sefidkon, 200630. m/0.25 mm/0.25 μm, He, 40. C @ 5. min, 4. K/min; Tend: 260. C
CapillaryDB-51731.Salehi, Sefidkon, et al., 200530. m/0.25 mm/0.25 μm, He, 60. C @ 4. min, 3. K/min; Tend: 220. C
CapillaryDB-51733.Abreu and Noronha, 1997He, 3. K/min; Column length: 30. m; Column diameter: 0.32 mm; Tstart: 60. C; Tend: 250. C

Normal alkane RI, polar column, temperature ramp

View large format table.

Column type Active phase I Reference Comment
CapillaryDB-Wax2273.Abreu and Noronha, 1997He, 3. K/min; Column length: 30. m; Column diameter: 0.32 mm; Tstart: 60. C; Tend: 250. C

References

Palmeira, Moura, et al., 2004
Palmeira, S.F., Jr.; Moura, F.S.; Alves, V.L.; de Oliveira, F.M.; Bento, E.S.; Conserva, L.M.; Andrade, E.H.A., Neutral components from hexane extracts of Croton sellowii, Flavour Fragr. J., 2004, 19, 1, 69-71, https://doi.org/10.1002/ffj.1298 . [all data]

Palá-Paúl, Velasco-Negueruela, et al., 2001
Palá-Paúl, J.; Velasco-Negueruela, A.; Pérez-Alonso, M.J.; Sanz, J., Analysis of the volatile components of Argyranthemum adauctum (Link.) Humphries by gas chromatography-mass spectrometry, J. Chromatogr. A, 2001, 923, 1-2, 295-298, https://doi.org/10.1016/S0021-9673(01)01003-2 . [all data]

de Marchese, de Heluani, et al., 2007
de Marchese, M.J.A.; de Heluani, C.S.; Catalán, C.A.N.; Griffin, C.A.; Vaughn, J.B., Jr.; Herz, W., Incisol, an alcohol with a novel sesquiterpene skeleton from Xenophyllum incisum, Biochem. Syst. Ecol., 2007, 35, 3, 169-175, https://doi.org/10.1016/j.bse.2006.10.006 . [all data]

bin Jantan, Yassin, et al., 2003
bin Jantan, I.; Yassin, M.S.M.; Chin, C.B.; Chen, L.L.; Sim. N.L., Antifungal activity of the essential oils of nine Zingiberaceae species, Pharm. Biol., 2003, 41, 5, 392-397, https://doi.org/10.1076/phbi.41.5.392.15941 . [all data]

Nogueira, Bittrich, et al., 2001
Nogueira, P.C.L.; Bittrich, V.; Shepherd, G.J.; Lopes, A.V.; Marsaioli, A.J., The ecological and taxonomic importance of flower volatiles of Clusia species (Guttiferae), Phytochemistry, 2001, 56, 5, 443-452, https://doi.org/10.1016/S0031-9422(00)00213-2 . [all data]

Richmond and Pombo-Villar, 1998
Richmond, R.; Pombo-Villar, E., Short communication. Use of persistent trace gas chromatography artifacts for the calculation of pseudo-Sadtler retention indices, J. Chromatogr. A, 1998, 811, 1-2, 241-245, https://doi.org/10.1016/S0021-9673(98)00285-4 . [all data]

Richmond and Pombo-Villar, 1997
Richmond, R.; Pombo-Villar, E., Short communication. Gas chromatography-mass spectrometry coupled with pseudo-Sadtler retention indices, for the identification of components in the essential oil of Curcuma longa L., J. Chromatogr. A, 1997, 760, 2, 303-308, https://doi.org/10.1016/S0021-9673(96)00802-3 . [all data]

Ahmad, Sirat, et al., 1994
Ahmad, U.K.; Sirat, H.M.; Sanagi, M.M.; Smith, R.M., Supercritical fluid extraction and capillary gas chromatography of the rhizomes of Z. zerumbet, J. Microcolumn Sep., 1994, 6, 1, 27-32, https://doi.org/10.1002/mcs.1220060107 . [all data]

Askari and Sefidkon, 2006
Askari, F.; Sefidkon, F., Essential oil composition of Pimpinella affinis Ledeb. from two localities in Iran, Flavour Fragr. J., 2006, 21, 5, 754-756, https://doi.org/10.1002/ffj.1619 . [all data]

Salehi, Sefidkon, et al., 2005
Salehi, P.; Sefidkon, F.; Bazzaz Tolami, L.; Sonboli, A., Essential oil composition of Salvia palaestina Benth. from Iran, Flavour Fragr. J., 2005, 20, 5, 525-527, https://doi.org/10.1002/ffj.1448 . [all data]

Abreu and Noronha, 1997
Abreu, P.M.; Noronha, R.G., Volatile constituents of the rhizomes of Aframomum alboviolaceum (Ridley) K. Schum. from Guinea-Bissau, Flavour Fragr. J., 1997, 12, 2, 79-83, https://doi.org/10.1002/(SICI)1099-1026(199703)12:2<79::AID-FFJ617>3.0.CO;2-7 . [all data]