Benzoic acid, 2,4-dihydroxy-3,6-dimethyl-, methyl ester

Van Den Dool and Kratz RI, non-polar column, custom temperature program

View large format table.

Column type Active phase I Reference Comment
CapillaryHP-5MS1734.7Andriamaharavo, 201430. m/0.25 mm/0.25 μm, He; Program: 60C (1 min) => 5 C/min => 210C => 10 C/min => 280C (15 min)

Normal alkane RI, non-polar column, temperature ramp

View large format table.

Column type Active phase I Reference Comment
CapillaryDB-5 MS1703.Stojanovic, RAdulovic, et al., 201130. m/0.25 mm/0.25 μm, Helium, 5. K/min, 290. C @ 10. min; Tstart: 70. C
CapillaryDB-11670.Rapior, Breheret, et al., 199730. m/0.2 mm/0.25 μm, He, 50. C @ 2. min, 4. K/min; Tend: 200. C

References

Andriamaharavo, 2014
Andriamaharavo, N.R., Retention Data. NIST Mass Spectrometry Data Center., NIST Mass Spectrometry Data Center, 2014. [all data]

Stojanovic, RAdulovic, et al., 2011
Stojanovic, I.Z.; RAdulovic, N.S.; Mitrovic, Y.L.J.; Stamenkovic, S.M.; Stojanovic, G.S., Volatile constituents of selected Parmeliaceae lichens, J. Serb. Chem. Soc., 2011, 76, 7, 987-994, https://doi.org/10.2298/JSC101004087S . [all data]

Rapior, Breheret, et al., 1997
Rapior, S.; Breheret, S.; Talou, T.; Bessiére, J.-M., Volatile flavor constituents of fresh Marasmius alliaceus (garlic Marasmius), J. Agric. Food Chem., 1997, 45, 3, 820-825, https://doi.org/10.1021/jf960511y . [all data]