C19H6F10

Gas phase ion energetics data

Data compiled by: John E. Bartmess

De-protonation reactions

C19H5F10- + Hydrogen cation = C19H6F10

By formula: C19H5F10- + H+ = C19H6F10

Quantity Value Units Method Reference Comment
Δr336.4 ± 2.2kcal/molG+TSKoppel, Taft, et al., 1994gas phase
Quantity Value Units Method Reference Comment
Δr328.4 ± 2.0kcal/molIMREKoppel, Taft, et al., 1994gas phase

References

Koppel, Taft, et al., 1994
Koppel, I.A.; Taft, R.W.; Anvia, F.; Zhu, S.Z.; Hu, L.Q.; Sung, K.S.; Desmarteau, D.D.; Yagupolskii, L.M., The Gas-Phase Acidities of Very Strong Neutral Bronsted Acids, J. Am. Chem. Soc., 1994, 116, 7, 3047, https://doi.org/10.1021/ja00086a038 . [all data]