Benzene, 2,4-dimethyl-1-(1-methylethyl)-

Phase change data

Data compiled as indicated in comments:
TRC - Thermodynamics Research Center, NIST Boulder Laboratories, Chris Muzny director
BS - Robert L. Brown and Stephen E. Stein

Quantity Value Units Method Reference Comment
Tboil472.KN/ARoberts and Good, 1951Uncertainty assigned by TRC = 5. K; TRC
Tboil468.KN/AUhlhorn, 1890Uncertainty assigned by TRC = 6. K; TRC

Reduced pressure boiling point

Tboil (K) Pressure (bar) Reference Comment
350.20.017Weast and Grasselli, 1989BS

In addition to the Thermodynamics Research Center (TRC) data available from this site, much more physical and chemical property data is available from the following TRC products:

References

Roberts and Good, 1951
Roberts, R.M.; Good, G.M., Effect of Nuclear Substitution on the Rate of SIlica-Zirconia-Alumina- Catalyzed Depropylation of Cumene, J. Am. Chem. Soc., 1951, 73, 1320. [all data]

Uhlhorn, 1890
Uhlhorn, E., Chem. Ber., 1890, 23, 2349. [all data]

Weast and Grasselli, 1989
CRC Handbook of Data on Organic Compounds, 2nd Editon, Weast,R.C and Grasselli, J.G., ed(s)., CRC Press, Inc., Boca Raton, FL, 1989, 1. [all data]