1-Propene, 1,1'-oxybis-, (E,E)-

Reaction thermochemistry data

Data compiled by: Hussein Y. Afeefy, Joel F. Liebman, and Stephen E. Stein

Individual Reactions

1-Propene, 1,1'-oxybis-, (E,E)- = 1-Propene, 1,1'-oxybis-, (Z,Z)-

By formula: C6H10O = C6H10O

Quantity Value Units Method Reference Comment
Δr-0.88 ± 0.07kcal/molEqkTaskinen and Virtanen, 1977liquid phase; solvent: Cyclohexane; Gas phase isomerization
Δr-1.2 ± 0.1kcal/molEqkTaskinen and Virtanen, 1977gas phase; solvent: Cyclohexane; Gas phase isomerization

1-Propene, 1,1'-oxybis-, (E,E)- = 1-Propene, 1,1'-oxybis-, (E,Z)-

By formula: C6H10O = C6H10O

Quantity Value Units Method Reference Comment
Δr-0.55 ± 0.1kcal/molEqkTaskinen and Virtanen, 1977gas phase; solvent: Cyclohexane; Gas phase isomerization
Δr-0.41 ± 0.07kcal/molEqkTaskinen and Virtanen, 1977liquid phase; solvent: Cyclohexane

References

Taskinen and Virtanen, 1977
Taskinen, E.; Virtanen, R., Thermocynamics of vinyl ethers. 19. Alkyl-substituted divinyl ethers, J. Org. Chem., 1977, 42, 1443-1449. [all data]