1H-3a,7-Methanoazulene, 2,3,4,7,8,8a-hexahydro-3,6,8,8-tetramethyl-, [3R-(3α,3aβ,7β,8aα)]-

Van Den Dool and Kratz RI, polar column, temperature ramp

Data compiled by: NIST Mass Spectrometry Data Center, William E. Wallace, director

Column type CapillaryCapillaryCapillaryCapillaryCapillary
Active phase RTX-WaxBP-20HP-WaxBP-20DB-Wax
Column length (m) 60.50.30.50.60.
Carrier gas HeHeN2HeN2
Substrate
Column diameter (mm) 0.220.220.250.220.25
Phase thickness (μm) 0.250.250.250.250.25
Tstart (C) 60.60.60.60.70.
Tend (C) 230.220.220.220.230.
Heat rate (K/min) 2.2.5.2.2.
Initial hold (min)   10. 2.
Final hold (min) 45.20. 20.20.
I 1566.1565.1568.1570.1571.
ReferenceCavalli, Tomi, et al., 2006Duquesnoy, Dinh, et al., 2006Flamini, Tebano, et al., 2006Gonny, Cavaleiro, et al., 2006Njoroge, Koaze, et al., 2005
Comment MSDC-RI MSDC-RI MSDC-RI MSDC-RI MSDC-RI
Column type CapillaryCapillaryCapillaryCapillaryCapillary
Active phase DB-WaxBP-20RTX-WaxDB-WaxDB-Wax
Column length (m) 30.50.60.60.60.
Carrier gas N2 HeN2He
Substrate
Column diameter (mm) 0.250.220.220.250.25
Phase thickness (μm) 0.250.250.250.250.25
Tstart (C) 60.60.60.70.50.
Tend (C) 220.220.230.230.180.
Heat rate (K/min) 5.2.2.2.2.5
Initial hold (min) 10.  2.5.
Final hold (min)  20.45.20.
I 1579.1565.1562.1574.1599.
ReferenceBertoli, Menichini, et al., 2004Gonny, Bradesi, et al., 2004Cavalli, Tomi, et al., 2003Choi and Sawamura, 2000Stashenko, Prada, et al., 1996
Comment MSDC-RI MSDC-RI MSDC-RI MSDC-RI MSDC-RI
Column type Capillary
Active phase Carbowax 20M
Column length (m) 60.
Carrier gas He
Substrate
Column diameter (mm) 0.32
Phase thickness (μm) 0.425
Tstart (C) 45.
Tend (C) 300.
Heat rate (K/min) 3.
Initial hold (min) 3.
Final hold (min) 20.
I 1576.
ReferenceMondello, Dugo, et al., 1995
Comment MSDC-RI

Kovats' RI, polar column, temperature ramp

Data compiled by: NIST Mass Spectrometry Data Center, William E. Wallace, director

Column type Capillary
Active phase Carbowax 20M
Column length (m) 50.
Carrier gas H2
Substrate
Column diameter (mm) 0.3
Phase thickness (μm) 0.15
Tstart (C) 70.
Tend (C) 210.
Heat rate (K/min) 2.
Initial hold (min)
Final hold (min)
I 1574.
ReferenceGaydou, Randriamiharisoa, et al., 1986
Comment MSDC-RI

Normal alkane RI, non-polar column, temperature ramp

Data compiled by: NIST Mass Spectrometry Data Center, William E. Wallace, director

Column type CapillaryCapillaryCapillaryCapillaryCapillary
Active phase Optima-5DB-5 MSDB-5HP-5 MSDB-5
Column length (m) 30.30.30.30.30.
Carrier gas HeliumHeliumHeliumHeliumHelium
Substrate
Column diameter (mm) 0.250.250.250.250.25
Phase thickness (μm) 0.250.250.250.250.25
Tstart (C) 60.60.50.100.40.
Tend (C) 246.270.250.220.250.
Heat rate (K/min) 3.3.2.2.10.
Initial hold (min) 1.   1.
Final hold (min)     3.
I 1415.1407.1412.1410.1412.
ReferenceAl-Qudah, Muhaidat, et al., 2012Cui, Yang, et al., 2011Ho, Wang, et al., 2010Pripdeevech, Chumpolsri, et al., 2010Yang, Zhang, et al., 2010
Comment MSDC-RI MSDC-RI MSDC-RI MSDC-RI MSDC-RI
Column type CapillaryCapillaryCapillaryCapillaryCapillary
Active phase DB-5DB-5HP-5HP-5DB-5
Column length (m) 30.30.30.30.30.
Carrier gas HeliumHeliumNitrogenN2Helium
Substrate
Column diameter (mm) 0.250.250.250.250.25
Phase thickness (μm) 0.250.250.250.250.25
Tstart (C) 35.50.50.60.100.
Tend (C) 220.250.280.220.300.
Heat rate (K/min) 3.5.5.5.20.
Initial hold (min)  2.1.10.2.
Final hold (min) 40. 1. 10.
I 1409.1412.1436.1411.1409.
ReferenceEl-Massry, El-Ghorab, et al., 2009Ho, Wang, et al., 2009Bousaada, Ammar, et al., 2008Flamini, Tebano, et al., 2008Khokra, Prakash, et al., 2008
Comment MSDC-RI MSDC-RI MSDC-RI MSDC-RI MSDC-RI
Column type CapillaryCapillaryCapillaryCapillaryCapillary
Active phase HP-5HP-5MSHP-1HP-5HP-5
Column length (m) 30.30.30.30.30.
Carrier gas HeliumHeHeliumHeN2
Substrate
Column diameter (mm) 0.250.250.250.250.25
Phase thickness (μm) 0.320.250.250.320.25
Tstart (C) 60.60.70.60.50.
Tend (C) 250.240.200.250.280.
Heat rate (K/min) 5.3.10.5.9.
Initial hold (min) 30.  30.3.
Final hold (min)     3.
I 1408.1413.1413.1408.1420.
ReferenceYassa and Akhani, 2008Argyropoulou, Daferera, et al., 2007Dongmo, Tatsadjieu, et al., 2007Yassa and Akhani, 2007Abdelwahed, Hayder, et al., 2006
Comment MSDC-RI MSDC-RI MSDC-RI MSDC-RI MSDC-RI
Column type CapillaryCapillaryCapillaryCapillaryCapillary
Active phase HP-5HP-5BP-1DB-1HP-5
Column length (m) 30.30.50.50.30.
Carrier gas N2HeHeN2He
Substrate
Column diameter (mm) 0.250.320.220.250.25
Phase thickness (μm) 0.250.250.250.250.25
Tstart (C) 50.60.60.95.60.
Tend (C) 280.246.220.240.220.
Heat rate (K/min) 9.3.2.4.5.
Initial hold (min) 3.   10.
Final hold (min) 3. 20.
I 1438.1410.1413.1397.1414.
ReferenceAbdelwahed, Hayder, et al., 2006Coronel, Cerda-Garcia-Rojas, et al., 2006Lesueur, Ban, et al., 2006Pala-Paul J., Perez-Alonso M.J., et al., 2006Pintore G., Chessa M., et al., 2006
Comment MSDC-RI MSDC-RI MSDC-RI MSDC-RI MSDC-RI
Column type CapillaryCapillaryCapillaryCapillaryCapillary
Active phase DB-5Ultra-2DB-5HP-1DB-1
Column length (m) 30.50.30.50.30.
Carrier gas HydrogenHeHe He
Substrate
Column diameter (mm) 0.250.250.250.20.25
Phase thickness (μm) 0.250.320.250.250.25
Tstart (C) 120.50.40.60.50.
Tend (C) 180.270.260.250.265.
Heat rate (K/min) 2.2.2.2.2.5
Initial hold (min)   5.60.1.
Final hold (min)   20. 20.
I 1430.1434.1405.1389.1389.
ReferencePripdeevech, Wongpornchai, et al., 2006Schlumpberger B.O., Clery R.A., et al., 2006Senatore, Landolfi, et al., 2006Fernandez, Lizzani-Cuvelier, et al., 2005Khanavi, Ghasemian, et al., 2005
Comment MSDC-RI MSDC-RI MSDC-RI MSDC-RI MSDC-RI
Column type CapillaryCapillaryCapillaryCapillaryCapillary
Active phase DB-1DB-1CP Sil 5 CBCP Sil 5 CBHP-5MS
Column length (m) 30.50.30.30.30.
Carrier gas HeN2HeHeHe
Substrate
Column diameter (mm) 0.250.250.250.250.25
Phase thickness (μm) 0.250.250.250.250.25
Tstart (C) 50.95.40.40.60.
Tend (C) 265.240.220.220.280.
Heat rate (K/min) 2.54.4.4.3.
Initial hold (min) 1. 1.1.
Final hold (min) 30.
I 1390.1405.1412.1412.1408.
ReferenceKhalighi-Sigaroodi, Hadijiakhoondi, et al., 2005Palá-Paúl, Pérez-Alonso, et al., 2005Rohloff and Bones, 2005Rohloff and Bones, 2005Slavkovska, Couladis, et al., 2005
Comment MSDC-RI MSDC-RI MSDC-RI MSDC-RI MSDC-RI
Column type CapillaryCapillaryCapillaryCapillaryCapillary
Active phase DB-1SPB-5HP-5DB-5HP-1
Column length (m) 60.60.25.30.30.
Carrier gas N2HeH2HeHe
Substrate
Column diameter (mm) 0.250.320.320.250.25
Phase thickness (μm) 0.251.0.520.250.25
Tstart (C) 70.60.40.60.70.
Tend (C) 230.200.240.240.200.
Heat rate (K/min) 2.4.4.4.10.
Initial hold (min) 2.
Final hold (min) 20.30.
I 1421.1409.1444.1411.1400.
ReferenceChoi, 2004Gauvin, Ravaomanarivo, et al., 2004Simic, Sokovic, et al., 2004Cabanillas, Lopez, et al., 2003Fekam Boyom, Amvam Zollo, et al., 2003
Comment MSDC-RI MSDC-RI MSDC-RI MSDC-RI MSDC-RI
Column type CapillaryCapillaryCapillaryCapillaryCapillary
Active phase DB-1HP-5MSDB-5MSDB-1DB-5
Column length (m) 30.30.30.50.30.
Carrier gas N2HeHeN2He
Substrate
Column diameter (mm) 0.250.250.250.250.25
Phase thickness (μm) 0.250.250.250.250.25
Tstart (C) 50.60.60.95.60.
Tend (C) 200.280.240.240.240.
Heat rate (K/min) 5.4.3.4.3.
Initial hold (min)
Final hold (min)
I 1397.1409.1418.1394.1408.
ReferenceFekam Boyom, Ngouana, et al., 2003Ghasemi, Asghari, et al., 2003Maia, Taveira, et al., 2003Perez-Alonso, Velasco-Negueruela, et al., 2003da Silva, Luz, et al., 2003
Comment MSDC-RI MSDC-RI MSDC-RI MSDC-RI MSDC-RI
Column type CapillaryCapillaryCapillaryCapillaryCapillary
Active phase DB-5HP-5HP-5DB-5DB-1
Column length (m) 30.60.60.30.50.
Carrier gas He  HeN2
Substrate
Column diameter (mm) 0.250.250.250.250.25
Phase thickness (μm) 0.250.250.250.250.25
Tstart (C) 60.40.40.35.80.
Tend (C) 240.250.250.280.225.
Heat rate (K/min) 3.5.5.4.4.
Initial hold (min)  15.15.2.
Final hold (min)    15.
I 1410.1420.1420.1420.1394.
Referenceda Silva, Luz, et al., 2003Stashenko, Jaramillo, et al., 2003Stashenko, Jaramillo, et al., 2003Krauze-Baranowska, Mardarowicz, et al., 2002Palá-Paúl, Pérez-Alonso, et al., 2002
Comment MSDC-RI MSDC-RI MSDC-RI MSDC-RI MSDC-RI
Column type CapillaryCapillaryCapillaryCapillaryCapillary
Active phase DB-5DB-5HP-1OV-101DB-5
Column length (m) 30.30.25.50.30.
Carrier gas HeHeH2N2He
Substrate
Column diameter (mm) 0.250.250.320.20.25
Phase thickness (μm) 0.250.250.17 0.25
Tstart (C) 60.60.40.80.60.
Tend (C) 300.240.260.200.240.
Heat rate (K/min) 2.3.3.1.3.
Initial hold (min)   5.
Final hold (min)    20.
I 1389.1409.1393.1433.1410.
ReferenceRuberto, Biondi, et al., 2002Tellez M., Estell R., et al., 2001Lopes, Koketsu, et al., 1999Menon, Chacko, et al., 1999Tellez, Canel, et al., 1999
Comment MSDC-RI MSDC-RI MSDC-RI MSDC-RI MSDC-RI
Column type CapillaryCapillaryCapillaryCapillaryCapillary
Active phase CP Sil 5 CBDB-5DB-5DB-1HP-101
Column length (m) 25.30.30.60.50.
Carrier gas N2HeHeliumHeH2
Substrate
Column diameter (mm) 0.320.250.250.250.32
Phase thickness (μm) 0.250.250.250.250.3
Tstart (C) 50.65.60.50.65.
Tend (C) 290.300.240.250.300.
Heat rate (K/min) 4.4.3.2.52.
Initial hold (min)  2. 5.5.
Final hold (min)
I 1398.1420.1411.1435.1407.
ReferenceBos, Woerdenbag, et al., 1997Elias, Simoneit, et al., 1997Tellez, Estell, et al., 1997Stashenko, Puertas, et al., 1996Demarne and van der Walt, 1993
Comment MSDC-RI MSDC-RI MSDC-RI MSDC-RI MSDC-RI
Column type CapillaryCapillaryCapillaryCapillaryCapillary
Active phase DB-1SE-30SE-30SE-30SE-30+Igepal
Column length (m) 60.30.30.50.100.
Carrier gas    He
Substrate
Column diameter (mm) 0.32  0.50.25
Phase thickness (μm)
Tstart (C) 50.50.50.40.70.
Tend (C) 230.240.240.170.170.
Heat rate (K/min) 4.4.4.3.1.
Initial hold (min)  2.2.3.
Final hold (min) 10.10.10.
I 1409.1411.1411.1434.1435.
ReferenceBinder, Benson, et al., 1990Ramaswami, Briscese, et al., 1988Ramaswami, Briscese, et al., 1986Heydanek and McGorrin, 1981Shibamoto and Jennings, 1977
Comment MSDC-RI MSDC-RI MSDC-RI MSDC-RI MSDC-RI
Column type Capillary
Active phase SE-30+Igepal
Column length (m) 100.
Carrier gas
Substrate
Column diameter (mm) 0.25
Phase thickness (μm)
Tstart (C) 70.
Tend (C) 170.
Heat rate (K/min) 1.
Initial hold (min)
Final hold (min)
I 1436.
ReferenceShibamoto and Jennings, 1977
Comment MSDC-RI

Kovats' RI, non-polar column, temperature ramp

Data compiled by: NIST Mass Spectrometry Data Center, William E. Wallace, director

Column type CapillaryCapillaryCapillaryCapillaryCapillary
Active phase SPB-1HP-5MSSPB-1DB-5DB-5
Column length (m) 30.30.30.25.30.
Carrier gas HeHeHeHeHe
Substrate
Column diameter (mm) 0.320.250.320.250.25
Phase thickness (μm) 0.250.250.25 0.25
Tstart (C) 60.60.50.40.60.
Tend (C) 240.200.250.280.
Heat rate (K/min) 4.4.2.3.3.
Initial hold (min) 4.1.2.5.
Final hold (min) 2.15.5.5.
I 1403.1408.1405.1404.1412.
ReferenceWalde, Jyothirmayi, et al., 2006Juliani, Zygadlo, et al., 2004Yadav, Chauhan, et al., 2004Amparo Blázquez, Pérez, et al., 2003Lucero, Estell, et al., 2003
Comment MSDC-RI MSDC-RI MSDC-RI MSDC-RI MSDC-RI
Column type CapillaryCapillaryCapillaryCapillaryCapillary
Active phase SE-30BP-1SE-54DB-5DB-5
Column length (m) 25.25.30.30.30.
Carrier gas HeN2 HeHe
Substrate
Column diameter (mm) 0.220.550.260.260.26
Phase thickness (μm) 0.250.250.250.250.25
Tstart (C) 70.60.60.60.60.
Tend (C) 220.220.246.246.246.
Heat rate (K/min) 4.5.3.3.3.
Initial hold (min)
Final hold (min)  15.
I 1411.1411.1409.1409.1409.
ReferencePalá-Paúl, Velasco-Negueruela, et al., 2002Jain, Aggarwal, et al., 2001Adams, 2000Adams, 2000, 2Adams, 1999
Comment MSDC-RI MSDC-RI MSDC-RI MSDC-RI MSDC-RI
Column type CapillaryCapillaryCapillary
Active phase DB-5HP-1OV-101
Column length (m) 30.15.100.
Carrier gas He H2
Substrate
Column diameter (mm) 0.250.320.3
Phase thickness (μm) 0.25 0.15
Tstart (C) 60.40.90.
Tend (C) 240.240.220.
Heat rate (K/min) 3.6.2.
Initial hold (min)
Final hold (min)  10.
I 1415.1398.1434.
Referenceda Silva, Andrade, et al., 1999Raharivelomanana, Cambon, et al., 1993Gaydou, Randriamiharisoa, et al., 1986
Comment MSDC-RI MSDC-RI MSDC-RI

Van Den Dool and Kratz RI, non-polar column, custom temperature program

Data compiled by: NIST Mass Spectrometry Data Center, William E. Wallace, director

Column type CapillaryCapillaryCapillaryCapillaryCapillary
Active phase HP-5MSCP-Sil5 CB MSDB-1DB-1CP Sil 5 CB
Column length (m) 30.60.30.30.
Carrier gas HeHeHeHe
Substrate
Column diameter (mm) 0.250.320.320.32
Phase thickness (μm) 0.250.250.10.25
Program 60C (1 min) => 5 C/min => 210C => 10 C/min => 280C (15 min)40C(1min) => 25C/min => 120C => 2C/min => 190C => 25C/min => 250C (5min)40C(5min) => 20C/min => 100C => 2C/min => 160C => 40C/min => 250C (5min)40C(5min) => 20C/min => 100C => 2C/min => 160C => 40C/min => 250C (5min)not specified
I 1416.71413.01383.11396.91436.
ReferenceAndriamaharavo, 2014Helmig, Bocquet, et al., 2004Helmig, Bocquet, et al., 2004Helmig, Bocquet, et al., 2004Chanegriha, Baaliouamer, et al., 1998
Comment MSDC-RI MSDC-RI MSDC-RI MSDC-RI MSDC-RI
Column type Capillary
Active phase SE-52
Column length (m) 60.
Carrier gas He
Substrate
Column diameter (mm) 0.32
Phase thickness (μm) 0.40
Program 45 C (6 min) 3 C/min -> 111 0C 2 C/min -> 160 C 3 C/min -> 300 C (15 min)
I 1421.
ReferenceMondello, Dugo, et al., 1995
Comment MSDC-RI

References

Cavalli, Tomi, et al., 2006
Cavalli, J.-F.; Tomi, F.; Bernardini, A.-F.; Casanova, J., Chemical variability of the essential oil of Helichrysum faradifani Sc. Ell. from Madagascar, Flavour Fragr. J., 2006, 21, 1, 111-114, https://doi.org/10.1002/ffj.1531 . [all data]

Duquesnoy, Dinh, et al., 2006
Duquesnoy, E.; Dinh, N.H.; Castola, V.; Casanova, J., Composition of a Pyrolytic oil from Cupressus funebris Endl. of Vietnamese origin, Flavour Fragr. J., 2006, 21, 3, 453-457, https://doi.org/10.1002/ffj.1676 . [all data]

Flamini, Tebano, et al., 2006
Flamini, G.; Tebano, M.; Cioni, P.L.; Bagci, Y.; Dural, H.; Ertugrul, K.; Uysal, T.; Savran, A., A multivariate statistical approach to Centaurea classification using essential oil composition data of some species from Turkey, Pl. Syst. Evol., 2006, 261, 1-4, 217-228, https://doi.org/10.1007/s00606-006-0448-3 . [all data]

Gonny, Cavaleiro, et al., 2006
Gonny, M.; Cavaleiro, C.; Salgueiro, L.; Casanova, J., Analysis of Juniperus communis subsp. alpina needle, berry, wood and root oils by combination of GC, GC/MS and 13C-NMR, Flavour Fragr. J., 2006, 21, 1, 99-106, https://doi.org/10.1002/ffj.1527 . [all data]

Njoroge, Koaze, et al., 2005
Njoroge, S.M.; Koaze, H.; Karanja, P.N.; Sawamura, M., Volatile Constituents of Redblush Grapefruit ( Citrus paradisi) and Pummelo ( Citrus grandis) Peel Essential Oils from Kenya, J. Agric. Food Chem., 2005, 53, 25, 9790-9794, https://doi.org/10.1021/jf051373s . [all data]

Bertoli, Menichini, et al., 2004
Bertoli, A.; Menichini, F.; Noccioli, C.; Morelli, I.; Pistelli, L., Volatile constituents of different organs of Psoralea bituminosa L., Flavour Fragr. J., 2004, 19, 2, 166-171, https://doi.org/10.1002/ffj.1315 . [all data]

Gonny, Bradesi, et al., 2004
Gonny, M.; Bradesi, P.; Casanova, J., Identification of the components of the essential oil from wild Corsican Daucus carota L. using 13C-NMR spectroscopy, Flavour Fragr. J., 2004, 19, 5, 424-433, https://doi.org/10.1002/ffj.1330 . [all data]

Cavalli, Tomi, et al., 2003
Cavalli, J.-F.; Tomi, F.; Bernardini, A.-F.; Casanova, J., Composition and chemical variability of the bark oil of Cedrelopsis grevei H. Baillon from Madagascar, Flavour Fragr. J., 2003, 18, 6, 532-538, https://doi.org/10.1002/ffj.1263 . [all data]

Choi and Sawamura, 2000
Choi, H.-S.; Sawamura, M., Composition of the essential oil of Citrus tamurana Hort. ex Tanaka (Hyuganatsu), J. Agric. Food Chem., 2000, 48, 10, 4868-4873, https://doi.org/10.1021/jf000651e . [all data]

Stashenko, Prada, et al., 1996
Stashenko, E.E.; Prada, N.Q.; Martínez, J.R., HRGC/FID/NP and HRGC/MSD study of Colombian Ylang-Ylang (Cananga odorata) oils obtained by different extraction techniques, J. Hi. Res. Chromatogr., 1996, 19, 6, 353-358, https://doi.org/10.1002/jhrc.1240190609 . [all data]

Mondello, Dugo, et al., 1995
Mondello, L.; Dugo, P.; Basile, A.; Dugo, G., Interactive use of linear retention indices, on polar and apolar columns, with a MS-library for reliable identification of complex mixtures, J. Microcolumn Sep., 1995, 7, 6, 581-591, https://doi.org/10.1002/mcs.1220070605 . [all data]