cycloeucalane

Kovats' RI, non-polar column, isothermal

Data compiled by: NIST Mass Spectrometry Data Center, William E. Wallace, director

Column type CapillaryCapillaryCapillary
Active phase Methyl SiliconeOV-101OV-101
Column length (m)  23.45.7
Carrier gas  HeHe
Substrate
Column diameter (mm)  0.30.5
Phase thickness (μm)
Temperature (C) 250.250.280.
I 3043.3040.3092.
ReferenceShlyakhov, 1984Kimble, Maxwell, et al., 1974Kimble, Maxwell, et al., 1974
Comment MSDC-RI MSDC-RI MSDC-RI

References

Shlyakhov, 1984
Shlyakhov, A.F., Gas chromatography in organic geochemistry, Nedra, Moscow, 1984, 221. [all data]

Kimble, Maxwell, et al., 1974
Kimble, B.J.; Maxwell, J.R.; Philp, R.P.; Eglinton, G., Identification of steranes and triterpanes in geolipid extracts by high-resolution gas chromatography and mass spectrometry, Chem. Geol., 1974, 14, 3, 173-198, https://doi.org/10.1016/0009-2541(74)90127-2 . [all data]