6-diazo-2,4-dinitrocyclohexa-2,4-dien-1-one

Condensed phase thermochemistry data

Data compiled by: Hussein Y. Afeefy, Joel F. Liebman, and Stephen E. Stein

Quantity Value Units Method Reference Comment
Δfsolid-116.kJ/molCcbFedoroff and Shefield, 1975
Δfsolid128.3kJ/molCcbGlowiak, 1961The author's hf298_condensed=-27.8 kcal/mol
Quantity Value Units Method Reference Comment
Δcsolid-2775.kJ/molCcbGlowiak, 1961The author's hf298_condensed=-27.8 kcal/mol
Δcsolid-2800.kJ/molCcbHandrick, 1956

References

Fedoroff and Shefield, 1975
Fedoroff, B.T.; Shefield, O.E., Table 1. Standard heats of formation and heats of detonation of common explosives in Encyclopedia of Explosives and Related Items, Part 2700 Volume 7, Picatinny Arsenal, Dover, NJ., 1975, 41-42. [all data]

Glowiak, 1961
Glowiak, B., Termochemiczna interpretacja wlasnosci wybuchowych I. Termochemiczna interpretacja wlasnosci wybucho-wych nitrowych pochodnych fenoli, Chem. Stosow., 1961, 576-598. [all data]

Handrick, 1956
Handrick, G.R., Report of the study of pure explosive compounds. Part IV. Calculation of heat of combustion of organic compounds from structural features and calculation of power of high explosives, Rpt. C-58247 for the Office of the Chief of Ordnance, contract DA-19-020-ORD-47 by the Arthur D. Little, Inc., Cambridge, MA, 1956, 467-573. [all data]