Rh3Co

Gas phase ion energetics data

Data compiled by: John E. Bartmess

Electron affinity determinations

EA (eV) Method Reference Comment
1.020 ± 0.050LPESWang, Ko, et al., 2011Vertical Detachment Energy: 1.18±0.05 eV

References

Wang, Ko, et al., 2011
Wang, H.P.; Ko, Y.J.; Garcia, L.G.; Sen, P.; Beltran, M.R.; Bowen, K.H., Joint photoelectron and theoretical study of (RhmCon)(-) (m=1-5, n=1-2) cluster anions and their neutral counterparts, Phys. Chem. Chem. Phys., 2011, 13, 17, 7685-7691, https://doi.org/10.1039/c0cp01674h . [all data]