(1R,4aR,7R,8aR)-7-(2-Hydroxypropan-2-yl)-1,4a-dimethyldecahydronaphthalen-1-ol

Van Den Dool and Kratz RI, non-polar column, custom temperature program

View large format table.

Column type Active phase I Reference Comment
CapillaryHP-5MS1822.1Andriamaharavo, 201430. m/0.25 mm/0.25 μm, He; Program: 60C (1 min) => 5 C/min => 210C => 10 C/min => 280C (15 min)

Normal alkane RI, non-polar column, temperature ramp

View large format table.

Column type Active phase I Reference Comment
CapillaryOptima-51826.Al-Qudah, Muhaidat, et al., 201230. m/0.25 mm/0.25 μm, Helium, 60. C @ 1. min, 3. K/min; Tend: 246. C
CapillaryBP-11780.Lesueur, Ban, et al., 200650. m/0.22 mm/0.25 μm, He, 2. K/min, 220. C @ 20. min; Tstart: 60. C
CapillaryHP-5MS1831.Robinson, 200630. m/0.25 mm/0.25 μm, 50. C @ 5. min, 10. K/min; Tend: 250. C

Normal alkane RI, polar column, temperature ramp

View large format table.

Column type Active phase I Reference Comment
CapillaryBP-202608.Lesueur, Ban, et al., 200650. m/0.22 mm/0.25 μm, He, 2. K/min, 220. C @ 20. min; Tstart: 60. C

References

Andriamaharavo, 2014
Andriamaharavo, N.R., Retention Data. NIST Mass Spectrometry Data Center., NIST Mass Spectrometry Data Center, 2014. [all data]

Al-Qudah, Muhaidat, et al., 2012
Al-Qudah, M.A.; Muhaidat, R.; Trawenh, I.N.; Jaber, H.I.; Abu Zarga, M.H.; Abu Orabi, S.T., Volatile constituents of leaves and bulbs of Gynandriris Sisyrinchicum and their antimicrobial activities, Jordan J. Chem., 2012, 7, 3, 287-295. [all data]

Lesueur, Ban, et al., 2006
Lesueur, D.; Ban, N.K.; Bighelli, A.; Muselli, A.; Casanova, J., Analysis of the root oil of Fokienia hodginsii (Dunn) Henry et Thomas (Cupressaceae) by GC, GC-MS and 13C-NMR, Flavour Fragr. J., 2006, 21, 1, 171-174, https://doi.org/10.1002/ffj.1557 . [all data]

Robinson, 2006
Robinson, C.J., A new essential oil - Agonis fragrans, A report for the Rural Industries Research and Development Corporation, RIRDC Publication No. 06/090, Rural Industries Research and Development Corporation, Barton, ACT, 2006, 12. [all data]