Bicyclo[2.2.1]heptan-2-ol, 2,3,3-trimethyl-

Van Den Dool and Kratz RI, non-polar column, temperature ramp

Data compiled by: NIST Mass Spectrometry Data Center, William E. Wallace, director

Column type CapillaryCapillaryCapillaryCapillaryCapillary
Active phase DB-5ZB-5HP-5DB-5DB-5
Column length (m) 30.30.30.30.30.
Carrier gas HeHeHeHeN2
Substrate
Column diameter (mm) 0.250.250.250.250.25
Phase thickness (μm) 0.250.250.250.250.25
Tstart (C) 60.50.60.50.60.
Tend (C) 260.250.250.250.240.
Heat rate (K/min) 5.3.3.5.3.
Initial hold (min)    2.
Final hold (min)
I 1154.1146.1151.1150.1150.
ReferenceSabulal, Dan, et al., 2007Simoniatto, Bonani, et al., 2007Javidnia, Miri, et al., 2006Su, Ho, et al., 2006Flamini, Cioni, et al., 2004
Comment MSDC-RI MSDC-RI MSDC-RI MSDC-RI MSDC-RI
Column type CapillaryCapillaryCapillaryCapillaryCapillary
Active phase HP-5MSDB-5MSHP-5DB-5MSHP-5
Column length (m) 30.30.50.30.30.
Carrier gas HeHeHeHeHe
Substrate
Column diameter (mm) 0.250.250.20.250.25
Phase thickness (μm) 0.250.250.20.250.25
Tstart (C) 60.40.40.40.60.
Tend (C) 280.280.250.200.240.
Heat rate (K/min) 4.4.3.4.3.
Initial hold (min) 5.2.15.5.
Final hold (min)   40.20.
I 1147.1155.1149.1157.1150.
ReferenceKarioti, Hadjipavlou-Litina, et al., 2004Mardarowicz, Wianowska, et al., 2004Stashenko, Jaramillo, et al., 2004Yu, Kim, et al., 2004Macchioni, Cioni, et al., 2003
Comment MSDC-RI MSDC-RI MSDC-RI MSDC-RI MSDC-RI

Kovats' RI, non-polar column, temperature ramp

View large format table.

Column type Active phase I Reference Comment
CapillaryDB-51148.Adams, González Elizondo, et al., 200630. m/0.26 mm/0.25 μm, He, 3. K/min; Tstart: 60. C; Tend: 246. C
CapillaryBP-11128.Srivastava, Srivastava, et al., 200630. m/0.32 mm/0.25 μm, N2, 5. K/min, 220. C @ 3. min; Tstart: 60. C
CapillaryDB-51148.Adams and Nguyen, 200530. m/0.26 mm/0.25 μm, He, 3. K/min; Tstart: 60. C; Tend: 246. C
CapillaryDB-51150.Lucero, Estell, et al., 200330. m/0.25 mm/0.25 μm, He, 3. K/min; Tstart: 60. C
CapillaryBP-11142.Raina, Srivastava, et al., 200225. m/0.55 mm/0.25 μm, N2, 5. K/min, 220. C @ 15. min; Tstart: 60. C
CapillaryHP-5MS1148.Salido, Altarejos, et al., 200230. m/0.25 mm/0.25 μm, He, 3. K/min; Tstart: 50. C; Tend: 250. C
CapillarySE-541148.Adams, 200030. m/0.26 mm/0.25 μm, He, 3. K/min; Tstart: 60. C; Tend: 246. C
CapillaryDB-51148.Adams, 2000, 230. m/0.26 mm/0.25 μm, He, 3. K/min; Tstart: 60. C; Tend: 240. C
CapillarySE-541148.Adams, 2000, 330. m/0.26 mm/0.25 μm, 3. K/min; Tstart: 60. C; Tend: 246. C
CapillaryDB-51148.Adams, 2000, 430. m/0.26 mm/0.25 μm, He, 3. K/min; Tstart: 60. C; Tend: 246. C
CapillaryDB-51148.Adams, 199930. m/0.26 mm/0.25 μm, He, 3. K/min; Tstart: 60. C; Tend: 246. C
CapillaryBP-11148.Breheret, Talou, et al., 199750. m/0.22 mm/1. μm, He, 3. K/min; Tstart: 50. C; Tend: 220. C
CapillaryOV-1011140.Menut, Molangui, et al., 1995N2, 5. K/min; Column length: 25. m; Column diameter: 0.25 mm; Tstart: 50. C; Tend: 200. C

Kovats' RI, non-polar column, custom temperature program

View large format table.

Column type Active phase I Reference Comment
CapillaryDB-51148.Adams, 199830. m/0.26 mm/0.25 μm; Program: not specified

Van Den Dool and Kratz RI, non-polar column, custom temperature program

View large format table.

Column type Active phase I Reference Comment
CapillaryBPX-51195.Elmore, Erbahadir, et al., 199750. m/0.32 mm/0.5 μm, He; Program: 0C (5min) => 40C/min => 40C (2min) => 10C/min => 280C

Van Den Dool and Kratz RI, polar column, temperature ramp

View large format table.

Column type Active phase I Reference Comment
CapillaryHP-Wax1518.Flamini, Cioni, et al., 200430. m/0.25 mm/0.25 μm, N2, 3. K/min; Tstart: 60. C; Tend: 240. C

Normal alkane RI, non-polar column, temperature ramp

View large format table.

Column type Active phase I Reference Comment
CapillaryRTX-11128.Yapi, Boti, et al., 201260. m/0.22 mm/0.25 μm, Helium, 2. K/min, 230. C @ 45. min; Tstart: 60. C
CapillaryDB-51150.Ho, Wang, et al., 201030. m/0.25 mm/0.25 μm, Helium, 2. K/min; Tstart: 50. C; Tend: 250. C
CapillaryDB-51150.Ho, Wang, et al., 200930. m/0.25 mm/0.25 μm, Helium, 50. C @ 2. min, 5. K/min; Tend: 250. C
CapillaryDB-51147.Lawal and Oyedelji, 200930. m/0.25 mm/0.25 μm, Helium, 5. K/min; Tstart: 70. C; Tend: 240. C
Capillary5 % Phenyl methyl siloxane1147.Retta, Gattuso, et al., 200960. m/0.25 mm/0.25 μm, Helium, 3. K/min, 225. C @ 3. min; Tstart: 90. C
CapillarySLB-5 MS1155.Lo Presti, Sciarrone, et al., 200830. m/0.25 mm/0.25 μm, Helium, 50. C @ 2. min, 3. K/min, 250. C @ 10. min
CapillaryElite-11152.Raj, Baby, et al., 200830. m/0.32 mm/0.25 μm, Helium, 3. K/min; Tstart: 60. C; Tend: 246. C
CapillaryHP-51147.Saidana, Mahjoub, et al., 200830. m/0.25 mm/0.25 μm, Nitrogen, 50. C @ 1. min, 5. K/min, 280. C @ 1. min
CapillaryHP-5 MS1148.Adams, Beauchamp, et al., 200730. m/0.25 mm/0.25 μm, Helium, 50. C @ 10. min, 3. K/min, 230. C @ 10. min
CapillaryHP-5MS1148.Bozin B., Mlmica-Dukic N., et al., 200730. m/0.25 mm/0.25 μm, He, 3. K/min; Tstart: 60. C; Tend: 280. C
CapillaryHP-51148.Cheraif, Ben Jannet, et al., 200730. m/0.25 mm/0.25 μm, N2, 50. C @ 1. min, 5. K/min, 240. C @ 4. min
CapillaryHP-11129.Filippi, Lanfranchi, et al., 200650. m/0.2 mm/0.33 μm, He, 2. K/min, 250. C @ 40. min; Tstart: 60. C
CapillaryDB-51151.Rout, Naik, et al., 200630. m/0.25 mm/0.25 μm, He, 2. K/min, 200. C @ 60. min; Tstart: 60. C
CapillaryDB-51154.Sabulal, Dan, et al., 200630. m/0.25 mm/0.25 μm, He, 5. K/min; Tstart: 60. C; Tend: 260. C
CapillaryHP-5MS1147.Setzer, Noletto, et al., 200530. m/0.25 mm/0.25 μm, He, 60. C @ 5. min, 3. K/min; Tend: 280. C
CapillaryBP-11133.Blanc, Muselli, et al., 200450. m/0.22 mm/0.25 μm, 2. K/min, 220. C @ 20. min; Tstart: 60. C
CapillaryCP Sil 5 CB1127.Kanjilal, Kotoky, et al., 200325. m/0.25 mm/0.25 μm, He, 35. C @ 2.5 min, 5. K/min; Tend: 280. C
CapillaryDB-51141.Marongiu, Porcedda, et al., 200330. m/0.25 mm/0.25 μm, He, 3. K/min, 280. C @ 30. min; Tstart: 60. C
CapillaryHP-51135.Pitarokili, Tzakou, et al., 200330. m/0.25 mm/0.25 μm, He, 3. K/min; Tstart: 60. C; Tend: 280. C
CapillaryZEBRON-51112.Öztürk, Akay, et al., 20026. m/0.25 mm/0.25 μm, He, 40. C @ 5. min, 3. K/min, 200. C @ 15. min
CapillaryDB-11132.Palá-Paúl, Pérez-Alonso, et al., 200250. m/0.25 mm/0.25 μm, N2, 4. K/min; Tstart: 80. C; Tend: 225. C
CapillaryDB-11128.Velasco-Negueruela, Pérez-Alonso, et al., 200250. m/0.25 mm/0.25 μm, N2, 3. K/min; Tstart: 60. C; Tend: 240. C
CapillaryDB-51150.Zoghbi, Andrade, et al., 200230. m/0.25 mm/0.25 μm, He, 3. K/min; Tstart: 60. C; Tend: 240. C
CapillaryDB-11185.Hedin, McKibben, et al., 200030. m/0.32 mm/0.25 μm, 45. C @ 2. min, 15. K/min, 300. C @ 5. min
CapillaryCP Sil 5 CB1128.Oyedeji, Olawore, et al., 1999He, 3. K/min; Column length: 25. m; Column diameter: 0.25 mm; Tstart: 50. C; Tend: 230. C
CapillaryDB-5MS1147.Zoghbi, Andrade, et al., 199930. m/0.25 mm/0.25 μm, He, 3. K/min; Tstart: 60. C; Tend: 240. C
CapillaryOV-1011130.Orav, Kailas, et al., 1996He, 2. K/min; Column length: 50. m; Column diameter: 0.25 mm; Tstart: 50. C; Tend: 250. C
CapillaryHP-11127.Thanh, Dung, et al., 199625. m/0.32 mm/0.25 μm, Helium, 60. C @ 2. min, 4. K/min, 220. C @ 20. min
CapillaryDB-11152.Nishimura, 199560. m/0.25 mm/0.25 μm, He, 3. K/min; Tstart: 80. C; Tend: 210. C

Normal alkane RI, non-polar column, custom temperature program

View large format table.

Column type Active phase I Reference Comment
Capillary5 % Phenyl polydimethyl siloxane1150.Chaverri, Diaz, et al., 2011Program: not specified
CapillarySLB-5 MS1156.Costa, De Fina, et al., 200830. m/0.25 mm/0.25 μm, Helium; Program: 50 0C 3 0C/min -> 250 0C (1 min) 10 0C/min -> 300 0C (5 min)
CapillarySLB-5 MS1155.Costa, De Fina, et al., 200830. m/0.25 mm/0.25 μm, Helium; Program: not specified
CapillarySLB-5 MS1156.Lo Presti, Sciarrone, et al., 200830. m/0.25 mm/0.25 μm, Helium; Program: not specified
CapillaryElite-11150.Raj, Baby, et al., 200830. m/0.32 mm/0.25 μm, Helium; Program: not specified
CapillaryHP-5MS1146.Cole, Haber, et al., 200730. m/0.25 mm/0.25 μm, He; Program: 40C(10min) => 3C/min => 200C => 2C/min => 220C
CapillaryHP-5 MS1146.Setzer, Stokes, et al., 2007Helium; Column length: 30. m; Column diameter: 0.25 mm; Program: 40 0C (10 min) 3 oC/min -> 200 0C 2 0C/min -> 220 0C
CapillaryHP-5MS1150.Yu, Huang, et al., 200730. m/0.25 mm/0.25 μm, He; Program: 40C(3min) => 6C/min => 160C => 10C/min => 300C (10min)
CapillaryHP-51150.Singh, Maurya, et al., 2005Column length: 30. m; Column diameter: 0.32 mm; Program: 65C(1min) => 1C/min => 75C (2min) => 0.5C/min => 81C(2min) => 3C/min => 180C(7min)
CapillarySE-301140.Vinogradov, 2004Program: not specified
CapillaryDB-51148.Viana, Andrade-Neto, et al., 200230. m/0.25 mm/0.1 μm, He; Program: 35C => 4C/min => 180C => 20C/min => 280C
CapillaryPolydimethyl siloxanes1140.Zenkevich, 1997Program: not specified
CapillaryHP-11136.Dung, Thanh, et al., 199624. m/0.32 mm/0.25 μm; Program: 60C(2min) => 4C/min => 120C => 2C/min => 220C (20min)

Normal alkane RI, polar column, temperature ramp

View large format table.

Column type Active phase I Reference Comment
CapillaryBP-201591.Yapi, Boti, et al., 201250. m/0.22 mm/0.25 μm, Helium, 2. K/min, 220. C @ 20. min; Tstart: 60. C
CapillaryTC-FFAP1602.Kurose, Okamura, et al., 2007He, 3. K/min, 220. C @ 30. min; Column diameter: 0.25 mm; Phase thickness: 0.25 μm; Tstart: 60. C
CapillaryHP-20M1545.Filippi, Lanfranchi, et al., 200650. m/0.2 mm/0.1 μm, He, 2. K/min, 220. C @ 30. min; Tstart: 60. C
CapillaryBP-201596.Blanc, Muselli, et al., 200450. m/0.22 mm/0.25 μm, 2. K/min, 220. C @ 20. min; Tstart: 60. C
CapillaryPEG-20M1589.Orav, Kailas, et al., 1996He, 2. K/min; Column length: 50. m; Column diameter: 0.25 mm; Tstart: 70. C; Tend: 250. C

References

Sabulal, Dan, et al., 2007
Sabulal, B.; Dan, M.; John, A.; Kurup, R.; Chandrika, S.P.; George, V., Phenylbutanoid-rich rhizome oil of Zingiber neesanum from Western Ghats, southern India, Flavour Fragr. J., 2007, 22, 6, 521-524, https://doi.org/10.1002/ffj.1834 . [all data]

Simoniatto, Bonani, et al., 2007
Simoniatto, E.; Bonani, V.F.L.; Morel, A.F.; Poppi, N.R.; Raposo, J.L., Jr.; Stuker, C.Z.; Peruzzo, G.M.; Peres, M.T.L.P.; Hess, S.C., Chemical composition and evaluation of antibacterial and antioxidant activities of the essential oil of Croton urucurana Baillon (Euphorbiaceae) stem bark, J. Braz. Chem., 2007, 18, 5, 879-885, https://doi.org/10.1590/S0103-50532007000500002 . [all data]

Javidnia, Miri, et al., 2006
Javidnia, K.; Miri, R.; Kamalinejad, M.; Khazraii, H., Chemical composition of the volatile oil of aerial parts of Valeriana sisymbriifolia Vahl. grown in Iran, Flavour Fragr. J., 2006, 21, 3, 516-518, https://doi.org/10.1002/ffj.1660 . [all data]

Su, Ho, et al., 2006
Su, Y.-C.; Ho, C.-L.; Wang, E.I.-C.; Chang, S.-T., Antifungal activities and chemical compositions of essential oils from leaves of four eucalypts, Taiwan J. For. Sci., 2006, 21, 1, 49-61. [all data]

Flamini, Cioni, et al., 2004
Flamini, G.; Cioni, P.L.; Morelli, I.; Maccioni, S.; Baldini, R., Phytochemical typologies in some populations of Myrtus communis L. on Caprione Promontory (East Liguria, Italy), Food Chem., 2004, 85, 4, 599-604, https://doi.org/10.1016/j.foodchem.2003.08.005 . [all data]

Karioti, Hadjipavlou-Litina, et al., 2004
Karioti, A.; Hadjipavlou-Litina, D.; Mensah, M.L.K.; Fleischer, T.C.; Skaltsa, H., Composition and antioxidant activity of the essential oils of Xylopia aethiopica (Dun) A. Rich. (Annonaceae) leaves, stem bark, root bark, and fresh and dried fruits, growing in Ghana, J. Agric. Food Chem., 2004, 52, 26, 8094-8098, https://doi.org/10.1021/jf040150j . [all data]

Mardarowicz, Wianowska, et al., 2004
Mardarowicz, M.; Wianowska, D.; Dawidowicz, A.L.; Sawicki, R., The influence of sample treatment on SPME extracts from conifers. I. Comparison of terpene composition in Engelmann Spruce (Picea engelmanii) using hydrodistillation, SPME and PLE, Annales Universitatis Mariae Curie-Sklodowska Lublin - Polonia, 2004, 59, 3, 25-42. [all data]

Stashenko, Jaramillo, et al., 2004
Stashenko, E.E.; Jaramillo, B.E.; Martínez, J.R., Analysis of volatile secondary metabolites from Colombian Xylopia aromatica (Lamarck) by different extraction and headspace methods and gas chromatography, J. Chromatogr. A, 2004, 1025, 1, 105-113, https://doi.org/10.1016/j.chroma.2003.10.059 . [all data]

Yu, Kim, et al., 2004
Yu, E.J.; Kim, T.H.; Kim, K.H.; Lee, H.J., Characterization of aroma-active compounds of Abies nephrolepis (Khingan fir) needles using aroma extract dilution analysis, Flavour Fragr. J., 2004, 19, 1, 74-79, https://doi.org/10.1002/ffj.1314 . [all data]

Macchioni, Cioni, et al., 2003
Macchioni, F.; Cioni, P.L.; Flamini, G.; Morelli, I.; Maccioni, S.; Ansaldi, M., Chemical composition of essential oils from needles, branches and cones of Pinus pinea, P. halepensis, P. pinaster and P. nigra from central Italy, Flavour Fragr. J., 2003, 18, 2, 139-143, https://doi.org/10.1002/ffj.1178 . [all data]