dl-Camphoroquinone

Phase change data

Data compiled by: Thermodynamics Research Center, NIST Boulder Laboratories, Chris Muzny director

Quantity Value Units Method Reference Comment
Tfus472.KN/AMurrill and Breed, 1970Uncertainty assigned by TRC = 5. K

In addition to the Thermodynamics Research Center (TRC) data available from this site, much more physical and chemical property data is available from the following TRC products:

Gas phase ion energetics data

Data compiled as indicated in comments:
LBLHLM - Sharon G. Lias, John E. Bartmess, Joel F. Liebman, John L. Holmes, Rhoda D. Levin, and W. Gary Mallard
LLK - Sharon G. Lias, Rhoda D. Levin, and Sherif A. Kafafi

Ionization energy determinations

IE (eV) Method Reference Comment
8.71 ± 0.05PEVerheijdt and Cerfontain, 1982Vertical value; LBLHLM
8.71PEArnett, Newkome, et al., 1974Vertical value; LLK
8.80PECowan, Gleiter, et al., 1971Vertical value; LLK

References

Murrill and Breed, 1970
Murrill, E.; Breed, L.W., Solid-solid phase transitions determined by differential scanning calorime- try. Part I. Tetrahedral Substances., Thermochim. Acta, 1970, 1, 239. [all data]

Verheijdt and Cerfontain, 1982
Verheijdt, P.L.; Cerfontain, H., Dipole moments, spectroscopy, and ground and excited state conformations of cycloalkane-1,2-diones, J. Chem. Soc. Perkin Trans. 2, 1982, 1541. [all data]

Arnett, Newkome, et al., 1974
Arnett, J.F.; Newkome, G.; Mattice, W.L.; McGlynn, S.P., Excited electronic states of the α-dicarbonyls, J. Am. Chem. Soc., 1974, 96, 4385. [all data]

Cowan, Gleiter, et al., 1971
Cowan, D.O.; Gleiter, R.; Hashmall, J.A.; Heilbronner, E.; Hornung, V., Interaction between the orbitals of lone pair electrons in dicarbonyl compounds, Angew. Chem. Int. Ed. Engl., 1971, 10, 401. [all data]