Carotol

Normal alkane RI, polar column, temperature ramp

Data compiled by: NIST Mass Spectrometry Data Center, William E. Wallace, director

Column type CapillaryCapillaryCapillaryCapillary
Active phase Supelcowax-10Supelcowax-10TC-WaxDB-Wax
Column length (m) 30.30.60.30.
Carrier gas   HeHe
Substrate
Column diameter (mm) 0.250.250.250.32
Phase thickness (μm) 0.250.25
Tstart (C) 40.40.80.60.
Tend (C) 250.210.250.250.
Heat rate (K/min) 2.2.4.3.
Initial hold (min)  2.
Final hold (min) 33.33.47.
I 2011.2019.2033.2024.
ReferenceSylvestre, Pichette, et al., 2007Lopez Arze, Collin, et al., 2004Miyazawa, Kurose, et al., 2001Abreu and Noronha, 1997
Comment MSDC-RI MSDC-RI MSDC-RI MSDC-RI

References

Sylvestre, Pichette, et al., 2007
Sylvestre, M.; Pichette, A.; Longtin, A.; Martin, M.-A.C.; Bercion, S.R.; Legault, J., Chemical composition of leaf essential oil of Hedyosmum arborescens and evaluation of its anticancer activity, Natural Product Communications, 2007, 2, 12, 1269-1272. [all data]

Lopez Arze, Collin, et al., 2004
Lopez Arze, J.B.; Collin, G.; Garneau, F.-X.; Jean, F.-I.; Gagnon, H., Essential oils from Bolivia. II. Asteraceae: Ophryosporus heptanthus (Wedd.) H. Rob. et King, J. Essent. Oil Res., 2004, 16, 4, 374-376, https://doi.org/10.1080/10412905.2004.9698747 . [all data]

Miyazawa, Kurose, et al., 2001
Miyazawa, M.; Kurose, K.; Itoh, A.; Hiraoka, N., Comparison of the essential oils of Glehnia littoralis from Northern and Southern Japan, J. Agric. Food Chem., 2001, 49, 11, 5433-5436, https://doi.org/10.1021/jf010219c . [all data]

Abreu and Noronha, 1997
Abreu, P.M.; Noronha, R.G., Volatile constituents of the rhizomes of Aframomum alboviolaceum (Ridley) K. Schum. from Guinea-Bissau, Flavour Fragr. J., 1997, 12, 2, 79-83, https://doi.org/10.1002/(SICI)1099-1026(199703)12:2<79::AID-FFJ617>3.0.CO;2-7 . [all data]