1,4-Methanoazulen-9-ol, decahydro-1,5,5,8a-tetramethyl-, [1R-(1α,3aβ,4α,8aβ,9S*)]-

Kovats' RI, non-polar column, temperature ramp

View large format table.

Column type Active phase I Reference Comment
CapillarySE-541592.Adams, 200030. m/0.26 mm/0.25 μm, 3. K/min; Tstart: 60. C; Tend: 246. C

Van Den Dool and Kratz RI, non-polar column, temperature ramp

View large format table.

Column type Active phase I Reference Comment
CapillaryBP-11588.Duquesnoy, Castola, et al., 200750. m/0.22 mm/0.25 μm, He, 2. K/min, 220. C @ 20. min; Tstart: 60. C
Capillary5 % Phenyl methyl siloxane1588.Djarri, Medjroubi, et al., 200625. m/0.25 mm/0.25 μm, He, 3. K/min, 280. C @ 20. min; Tstart: 60. C
CapillaryDB-51593.Dob, Dahmane, et al., 200630. m/0.25 mm/0.25 μm, N2, 60. C @ 3. min, 3. K/min, 240. C @ 3. min
CapillaryBP-11592.Gonny, Cavaleiro, et al., 200650. m/0.22 mm/0.25 μm, He, 2. K/min, 220. C @ 20. min; Tstart: 60. C
CapillaryHP-51594.Macchioni, Cioni, et al., 200330. m/0.25 mm/0.25 μm, He, 3. K/min; Tstart: 60. C; Tend: 240. C
CapillaryHP-5MS1592.Demetzos, Angelopoulou, et al., 200230. m/0.25 mm/0.25 μm, 50. C @ 5. min, 3. K/min; Tend: 280. C
CapillaryHP-51583.Couladis, Tsortanidou, et al., 200130. m/0.25 mm/0.25 μm, He, 3. K/min; Tstart: 60. C; Tend: 380. C
CapillaryDB-51592.Isidorov, Zenkevich, et al., 199830. m/0.25 mm/0.25 μm, 3. K/min; Tstart: 50. C; Tend: 250. C

Van Den Dool and Kratz RI, non-polar column, custom temperature program

View large format table.

Column type Active phase I Reference Comment
CapillaryHP-5MS1607.1Andriamaharavo, 201430. m/0.25 mm/0.25 μm, He; Program: 60C (1 min) => 5 C/min => 210C => 10 C/min => 280C (15 min)

Van Den Dool and Kratz RI, polar column, temperature ramp

View large format table.

Column type Active phase I Reference Comment
CapillaryBP-202151.Duquesnoy, Castola, et al., 200750. m/0.22 mm/0.25 μm, He, 2. K/min, 220. C @ 20. min; Tstart: 60. C
CapillaryBP-202157.Gonny, Cavaleiro, et al., 200650. m/0.22 mm/0.25 μm, He, 2. K/min, 220. C @ 20. min; Tstart: 60. C

Normal alkane RI, non-polar column, temperature ramp

View large format table.

Column type Active phase I Reference Comment
CapillaryDB-51567.Pattiram, Lasekan, et al., 201130. m/0.32 mm/0.25 μm, Helium, 2. K/min; Tstart: 35. C; Tend: 200. C
CapillaryDB-11579.Khanavi, Ghasemian, et al., 200530. m/0.25 mm/0.25 μm, He, 50. C @ 1. min, 2.5 K/min, 265. C @ 20. min
CapillaryCP Sil 5 CB1599.Rohloff and Bones, 200530. m/0.25 mm/0.25 μm, He, 40. C @ 1. min, 4. K/min; Tend: 220. C
CapillaryCP Sil 5 CB1599.Rohloff and Bones, 200530. m/0.25 mm/0.25 μm, He, 40. C @ 1. min, 4. K/min; Tend: 220. C
CapillaryHP-51592.Utsunomia, Kawata, et al., 200530. m/0.32 mm/0.25 μm, Helium, 4. K/min, 300. C @ 5. min; Tstart: 40. C
CapillaryOV-1011603.Boyom, Keumedjio, et al., 20025. K/min; Column length: 25. m; Column diameter: 0.32 mm; Tstart: 50. C; Tend: 200. C
CapillarySPB-51592.Pino, Marbot, et al., 200230. m/0.25 mm/0.25 μm, Helium, 60. C @ 2. min, 4. K/min, 250. C @ 20. min

Normal alkane RI, non-polar column, custom temperature program

View large format table.

Column type Active phase I Reference Comment
CapillaryCP Sil 8 CB1599.Butkienë, Nivinskienë, et al., 200550. m/0.32 mm/0.25 μm, He; Program: 50C(5min) => 2C/min => 90C => 15C/min => 240C(4min)

Normal alkane RI, polar column, temperature ramp

View large format table.

Column type Active phase I Reference Comment
CapillaryTC-FFAP2151.Kurose, Okamura, et al., 2007He, 3. K/min, 220. C @ 30. min; Column diameter: 0.25 mm; Phase thickness: 0.25 μm; Tstart: 60. C
CapillaryPEG-20M2147.Yao, Guo, et al., 200560. C @ 10. min, 3. K/min, 180. C @ 30. min; Column length: 30. m; Column diameter: 0.25 mm
CapillaryTC-Wax2163.Miyazawa, Yamafuji, et al., 20033. K/min; Column length: 60. m; Column diameter: 0.25 mm; Tstart: 80. C; Tend: 240. C

Normal alkane RI, polar column, custom temperature program

View large format table.

Column type Active phase I Reference Comment
CapillaryHP-Innowax FSC2174.Bagci, Baser, et al., 199960. m/0.25 mm/0.25 μm, He; Program: 60C(10min) => 4C/min => 220C(10min) => 1C/min => 240C

References

Adams, 2000
Adams, R.P., Systematics of the one seeded Juniperus of the eastern hemisphere based on leaf essential oils and random amplified polymorphic DNAs (RAPDs), Biochem. Syst. Ecol., 2000, 28, 6, 529-543, https://doi.org/10.1016/S0305-1978(99)00096-4 . [all data]

Duquesnoy, Castola, et al., 2007
Duquesnoy, E.; Castola, V.; Casanova, J., Composition and chemical variability of the twig oil of Abies alba Miller from Corsica, Flavour Fragr. J., 2007, 22, 4, 293-299, https://doi.org/10.1002/ffj.1796 . [all data]

Djarri, Medjroubi, et al., 2006
Djarri, L.; Medjroubi, K.; Akkal, S.; Elomri, A.; Seguin, E.; Vérité, P., Composition of the essential oil of aerial parts of an endemic species of the Apiaceae of Algeria, Daucus reboudii Coss., Flavour Fragr. J., 2006, 21, 4, 647-649, https://doi.org/10.1002/ffj.1636 . [all data]

Dob, Dahmane, et al., 2006
Dob, T.; Dahmane, D.; Agli, M.; Chelghoum, C., Essential oil composition of Lavandula stoechas from Algeria, Pharm. Biol., 2006, 44, 1, 60-64, https://doi.org/10.1080/13880200500496421 . [all data]

Gonny, Cavaleiro, et al., 2006
Gonny, M.; Cavaleiro, C.; Salgueiro, L.; Casanova, J., Analysis of Juniperus communis subsp. alpina needle, berry, wood and root oils by combination of GC, GC/MS and 13C-NMR, Flavour Fragr. J., 2006, 21, 1, 99-106, https://doi.org/10.1002/ffj.1527 . [all data]

Macchioni, Cioni, et al., 2003
Macchioni, F.; Cioni, P.L.; Flamini, G.; Morelli, I.; Maccioni, S.; Ansaldi, M., Chemical composition of essential oils from needles, branches and cones of Pinus pinea, P. halepensis, P. pinaster and P. nigra from central Italy, Flavour Fragr. J., 2003, 18, 2, 139-143, https://doi.org/10.1002/ffj.1178 . [all data]

Demetzos, Angelopoulou, et al., 2002
Demetzos, C.; Angelopoulou, D.; Perdetzoglou, D., A comparative study of the essential oils of Cistus salviifolius in several populations of Crete (Greece), Biochem. Syst. Ecol., 2002, 30, 7, 651-665, https://doi.org/10.1016/S0305-1978(01)00145-4 . [all data]

Couladis, Tsortanidou, et al., 2001
Couladis, M.; Tsortanidou, V.; Francisco-Ortega, J.; Santos-Guerra, A.; Harvala, C., Composition of the essential oils of Argyranthemum species growing in the Canary Islands, Flavour Fragr. J., 2001, 16, 2, 103-106, https://doi.org/10.1002/ffj.954 . [all data]

Isidorov, Zenkevich, et al., 1998
Isidorov, V.A.; Zenkevich, I.G.; Dubis, E.N.; Slowikowski, A.; Wojciuk, E., Group identification of essential oils components using partition coefficients in a hexane-acetonitrile system, J. Chromatogr. A, 1998, 814, 1-2, 253-260, https://doi.org/10.1016/S0021-9673(98)00398-7 . [all data]

Andriamaharavo, 2014
Andriamaharavo, N.R., Retention Data. NIST Mass Spectrometry Data Center., NIST Mass Spectrometry Data Center, 2014. [all data]

Pattiram, Lasekan, et al., 2011
Pattiram, P.D.; Lasekan, O.; Tan, C.P.; Zaidul, I.S.M., Identification of the aroma-active constituents of the essential oils of Water Dropwort (Oenanthe javanica) and Kacip Fatimah (Labisia pumilia), Int. Food Res. J., 2011, 18, 3, 1021-1026. [all data]

Khanavi, Ghasemian, et al., 2005
Khanavi, M.; Ghasemian, L.; Motlagh, E.H.; Hadjiakhoondi, A.; Shafiee, A., Chemical composition of the essential oils of Marrubium parviflorum Fisch. C.A. Mey. and Marrubium vulgare L. from Iran, Flavour Fragr. J., 2005, 20, 3, 324-326, https://doi.org/10.1002/ffj.1425 . [all data]

Rohloff and Bones, 2005
Rohloff, J.; Bones, A.M., Volatile profiling of Arabidopsis thaliana - Putative olfactory compounds in plant communication, Phytochemistry, 2005, 66, 16, 1941-1955, https://doi.org/10.1016/j.phytochem.2005.06.021 . [all data]

Utsunomia, Kawata, et al., 2005
Utsunomia, H.; Kawata, J.; Chanoki, W.; Shirakawa, N.; Miyazawa, M., Components of Essential Oil from Woods of Prunus mume Sieb. at Zucc., J. Oleo Sci., 2005, 54, 11, 609-612, https://doi.org/10.5650/jos.54.609 . [all data]

Boyom, Keumedjio, et al., 2002
Boyom, F.F.; Keumedjio, F.; Dongmo, P.M.J.; Ngadjui, B.T.; Zollo, A.; Menut, C.; Bessiere, J.M., Essential oils from Croton zambesicus Muell. Arg. growing in Cameroon, Flavour Fragr. J., 2002, 17, 3, 215-217, https://doi.org/10.1002/ffj.1081 . [all data]

Pino, Marbot, et al., 2002
Pino, J.A.; Marbot, R.; Vazquez, C., Characterization of volatiles in Loquat fruit (Eriobotrya japonica Lindl.), Revista CENIC Ciencias Quimicas, 2002, 33, 3, 115-119. [all data]

Butkienë, Nivinskienë, et al., 2005
Butkienë, R.; Nivinskienë, O.; Mockutë, D., α-Pinene chemotype of leaf (needle) essential oils of Juniperus communis L. growing wild in Vilnius district, Chemija, 2005, 16, 1, 53-60. [all data]

Kurose, Okamura, et al., 2007
Kurose, K.; Okamura, D.; Yatagai, M., Composition of the essential oils from the leaves of nine Pinus species and the cones of three of Pinus species, Flavour Fragr. J., 2007, 22, 1, 10-20, https://doi.org/10.1002/ffj.1609 . [all data]

Yao, Guo, et al., 2005
Yao, S.-S.; Guo, W.-F.; Lu, Y.; Jiang, Y.-X., Flavor Characteristics of Lapsang Souchong and Smoked Lapsang Souchong, a Special Chinese Black Tea with Pine Smoking Process, J. Agric. Food Chem., 2005, 53, 22, 8688-8693, https://doi.org/10.1021/jf058059i . [all data]

Miyazawa, Yamafuji, et al., 2003
Miyazawa, M.; Yamafuji, C.; Kurose, K.; Ishikawa, Y., Volatile components of the rhizomes of Cirsium japonicum DC, Flavour Fragr. J., 2003, 18, 1, 15-17, https://doi.org/10.1002/ffj.1135 . [all data]

Bagci, Baser, et al., 1999
Bagci, E.; Baser, K.H.C.; Kürkcüoglu, M.; Babac, T.; Celik, S., Study of the essential oil composition of two subspecies of Abies cilicica (Ant. et Kotschy) Carr. from Turkey, Flavour Fragr. J., 1999, 14, 1, 47-49, https://doi.org/10.1002/(SICI)1099-1026(199901/02)14:1<47::AID-FFJ782>3.0.CO;2-R . [all data]