1H-Indene-1,2-diol, 2,3-dihydro-, cis-

Condensed phase thermochemistry data

Data compiled by: Hussein Y. Afeefy, Joel F. Liebman, and Stephen E. Stein

Quantity Value Units Method Reference Comment
Δcsolid-4592. ± 4.kJ/molCcbVerkade, Coops, et al., 1928At 288 °K; Corresponding Δfsolid = -379. kJ/mol (simple calculation by NIST; no Washburn corrections)

Kovats' RI, non-polar column, isothermal

View large format table.

Column type Active phase Temperature (C) I Reference Comment
PackedOV-1120.1400.Brooks, Cole, et al., 1982Helium or Nitrogen, Gas-Chrom Q (100-120 mesh); Column length: 1.8 m; Column diameter: 0.25 mm

References

Verkade, Coops, et al., 1928
Verkade, P.E.; Coops, J., Jr.; Maan, Chr.J., Calorimetrische Untersuchungen. XV. Thermochemische studien uber cycloparaffine und ihre derivate: 1. Experimentelle daten fur funf- und sechsgliedrige cyclische diole, Ann., 1928, 467, 217-239. [all data]

Brooks, Cole, et al., 1982
Brooks, C.J.W.; Cole, W.J.; Borthwick, J.H.; Brown, G.M., Characterization of Dihydroarenediols and Related Compounds by Gas Chromatography-Mass Spectrometry: Comparison of Derivatives, J. Chromatogr., 1982, 239, 191-216, https://doi.org/10.1016/S0021-9673(00)81980-9 . [all data]