Ethanone, 2-iodo-1-phenyl-

Gas phase ion energetics data

Data compiled by: Sharon G. Lias, John E. Bartmess, Joel F. Liebman, John L. Holmes, Rhoda D. Levin, and W. Gary Mallard

Ionization energy determinations

IE (eV) Method Reference Comment
9.21PEDistefano, Granozzi, et al., 1987Vertical value

References

Distefano, Granozzi, et al., 1987
Distefano, G.; Granozzi, G.; Olivato, P.R.; Guerrero, S.A., Hyperconjugative interactions in halogen-substituted carbonyls: Ultraviolet photoelectron spectroscopy of w-halogenoacetophenones, J. Chem. Soc. Perkin Trans. 2, 1987, 1459. [all data]