(Z)-1-chlorobut-2-ene

Gas phase thermochemistry data

Data compiled by: Hussein Y. Afeefy, Joel F. Liebman, and Stephen E. Stein

Quantity Value Units Method Reference Comment
Δfgas-37.7kJ/molEqkLevanova, Rodova, et al., 1974

References

Levanova, Rodova, et al., 1974
Levanova, S.V.; Rodova, R.M.; Rozhnov, A.M.; Shevtsova, L.A., Thermodynamic calculation of the equilibrium composition of chlorobutene mixtures, Russ. J. Phys. Chem. (Engl. Transl.), 1974, 48, 1113-1114. [all data]