C7H5F3OS

Reaction thermochemistry data

Data compiled by: John E. Bartmess

Individual Reactions

C7H4F3OS- + Hydrogen cation = C7H5F3OS

By formula: C7H4F3OS- + H+ = C7H5F3OS

Quantity Value Units Method Reference Comment
Δr1402. ± 8.8kJ/molG+TSTaft and Topsom, 1987gas phase; value altered from reference due to change in acidity scale
Quantity Value Units Method Reference Comment
Δr1374. ± 8.4kJ/molIMRETaft and Topsom, 1987gas phase; value altered from reference due to change in acidity scale

Gas phase ion energetics data

Data compiled by: John E. Bartmess

De-protonation reactions

C7H4F3OS- + Hydrogen cation = C7H5F3OS

By formula: C7H4F3OS- + H+ = C7H5F3OS

Quantity Value Units Method Reference Comment
Δr335.2 ± 2.1kcal/molG+TSTaft and Topsom, 1987gas phase; value altered from reference due to change in acidity scale
Quantity Value Units Method Reference Comment
Δr328.4 ± 2.0kcal/molIMRETaft and Topsom, 1987gas phase; value altered from reference due to change in acidity scale

References

Taft and Topsom, 1987
Taft, R.W.; Topsom, R.D., The Nature and Analysis of Substituent Effects, Prog. Phys. Org. Chem., 1987, 16, 1. [all data]