Perfluoroallene

Gas phase ion energetics data

Data compiled by: Sharon G. Lias, Rhoda D. Levin, and Sherif A. Kafafi

Ionization energy determinations

IE (eV) Method Reference Comment
10.88PEThomas and Thompson, 1974
11.24PEThomas and Thompson, 1974Vertical value

References

Thomas and Thompson, 1974
Thomas, R.K.; Thompson, H., The photoelectron spectra of allene, deuteroallenes and tetrafluoroallene, Proc. R. Soc. London A:, 1974, 339, 29. [all data]