Dicyandiamide

Phase change data

Data compiled by: William E. Acree, Jr., James S. Chickos

Enthalpy of sublimation

ΔsubH (kJ/mol) Temperature (K) Method Reference Comment
128.7436.TE,MEDe Wit, Van Miltenburg, et al., 1983Based on data from 420. - 450. K.

Enthalpy of fusion

ΔfusH (kJ/mol) Temperature (K) Reference
22.96487.6Zhang, Tan, et al., 1997

Condensed phase thermochemistry data

Data compiled as indicated in comments:
ALS - Hussein Y. Afeefy, Joel F. Liebman, and Stephen E. Stein
DH - Eugene S. Domalski and Elizabeth D. Hearing

Quantity Value Units Method Reference Comment
Δfsolid5.08 ± 0.48kcal/molCcbMedard and Thomas, 1952Reanalyzed by Cox and Pilcher, 1970, Original value = 5.56 kcal/mol; Author's hf291_condensed=4.5 kcal/mol; ALS
Δfsolid5.96kcal/molCcbSalley and Gray, 1951correction of Salley and Gray, 1948; ALS
Quantity Value Units Method Reference Comment
Δcsolid-329.261kcal/molCcbHandrick, 1956ALS
Δcsolid-329.81 ± 0.48kcal/molCcbMedard and Thomas, 1952Reanalyzed by Cox and Pilcher, 1970, Original value = -330.3 kcal/mol; Author's hf291_condensed=4.5 kcal/mol; ALS
Δcsolid-330.70kcal/molCcbSalley and Gray, 1951correction of Salley and Gray, 1948; ALS
Quantity Value Units Method Reference Comment
solid,1 bar30.901cal/mol*KN/AStephenson and Berets, 1952DH

Constant pressure heat capacity of solid

Cp,solid (cal/mol*K) Temperature (K) Reference Comment
33.9340.David, 1964T = 298 to 373 K. Mean value. T = uncertain.; DH
28.141294.63Stephenson and Berets, 1952T = 15 to 300 K. Value is unsmoothed experimental datum.; DH

References

De Wit, Van Miltenburg, et al., 1983
De Wit, H.G.M.; Van Miltenburg, J.C.; De Kruif, C.G., Thermodynamic properties of molecular organic crystals containing nitrogen, oxygen, and sulphur 1. Vapour pressures and enthalpies of sublimation, The Journal of Chemical Thermodynamics, 1983, 15, 7, 651-663, https://doi.org/10.1016/0021-9614(83)90079-4 . [all data]

Zhang, Tan, et al., 1997
Zhang, Ji-Biao; Tan, Zhi-Cheng; Meng, Shuang-He; Li, Shao-Hui; Zhang, Li-Ming, Heat capacity and thermal decomposition of dicyandiamide, Thermochimica Acta, 1997, 307, 1, 11-15, https://doi.org/10.1016/S0040-6031(97)00323-7 . [all data]