1,1,1-trifluoro-3-nitropropane

Phase change data

Data compiled by: Thermodynamics Research Center, NIST Boulder Laboratories, Chris Muzny director

Quantity Value Units Method Reference Comment
Tboil408.7KN/AMcBee, Hass, et al., 1950Uncertainty assigned by TRC = 2. K

In addition to the Thermodynamics Research Center (TRC) data available from this site, much more physical and chemical property data is available from the following TRC products:

References

McBee, Hass, et al., 1950
McBee, E.T.; Hass, H.B.; Robinson, I.M., Nitration of 1,1,1-Trifluoropropane, J. Am. Chem. Soc., 1950, 1950, 72. 3579-80. [all data]