Ethyl (Z)-cinnamate

Kovats' RI, non-polar column, temperature ramp

View large format table.

Column type Active phase I Reference Comment
CapillaryDB-51360.6El-Massry, El-Ghorab, et al., 200230. m/0.25 mm/0.5 μm, 50. C @ 3. min, 7. K/min, 250. C @ 10. min

Van Den Dool and Kratz RI, non-polar column, temperature ramp

View large format table.

Column type Active phase I Reference Comment
CapillaryHP-5MS1374.Demetzos, Angelopoulou, et al., 200230. m/0.25 mm/0.25 μm, 50. C @ 5. min, 3. K/min; Tend: 280. C
CapillaryDB-51373.Isidorov, Zenkevich, et al., 2001He, 3. K/min; Column length: 30. m; Column diameter: 0.25 mm; Tstart: 50. C; Tend: 250. C

Van Den Dool and Kratz RI, non-polar column, custom temperature program

View large format table.

Column type Active phase I Reference Comment
CapillaryHP-5MS1381.9Andriamaharavo, 201430. m/0.25 mm/0.25 μm, He; Program: 60C (1 min) => 5 C/min => 210C => 10 C/min => 280C (15 min)

Normal alkane RI, non-polar column, temperature ramp

View large format table.

Column type Active phase I Reference Comment
CapillaryHP-51373.Bicalho, Pereira, et al., 200030. m/0.25 mm/0.25 μm, H2, 40. C @ 10. min, 3. K/min, 280. C @ 10. min
CapillaryBP-11346.Mallavarapu, Kulkarni, et al., 199925. m/0.50 mm/0.25 μm, N2, 5. K/min, 220. C @ 10. min; Tstart: 60. C

Normal alkane RI, non-polar column, custom temperature program

View large format table.

Column type Active phase I Reference Comment
CapillaryDB-51374.Isidorov, Zenkevich, et al., 2001He; Column length: 30. m; Column diameter: 0.25 mm; Program: not specified

Normal alkane RI, polar column, custom temperature program

View large format table.

Column type Active phase I Reference Comment
CapillaryInnowax FSC2012.Saglam, Gozler, et al., 200160. m/0.25 mm/0.25 μm, He; Program: 60C(10min) => 4C/min => 220C(10min) => 1C/min => 240C

References

El-Massry, El-Ghorab, et al., 2002
El-Massry, K.F.; El-Ghorab, A.H.; Farouk, A., Antioxidant activity and volatile components of Egyptian Artemisia judaica L., Food Chem., 2002, 79, 3, 331-336, https://doi.org/10.1016/S0308-8146(02)00164-4 . [all data]

Demetzos, Angelopoulou, et al., 2002
Demetzos, C.; Angelopoulou, D.; Perdetzoglou, D., A comparative study of the essential oils of Cistus salviifolius in several populations of Crete (Greece), Biochem. Syst. Ecol., 2002, 30, 7, 651-665, https://doi.org/10.1016/S0305-1978(01)00145-4 . [all data]

Isidorov, Zenkevich, et al., 2001
Isidorov, V.A.; Zenkevich, I.G.; Krajewska, U.; Dubis, E.N.; Jaroszynska, J.; Bal, K., Gas chromatographic analysis of essential oils with preliminary partition of components, Phytochem. Anal., 2001, 12, 2, 87-90, https://doi.org/10.1002/pca.564 . [all data]

Andriamaharavo, 2014
Andriamaharavo, N.R., Retention Data. NIST Mass Spectrometry Data Center., NIST Mass Spectrometry Data Center, 2014. [all data]

Bicalho, Pereira, et al., 2000
Bicalho, B.; Pereira, A.S.; Aquino Neto, F.R.; Pinto, A.C.; Rezende, C.M., Application of high-temperature gas chromatography-mass spectrometry to the investigation of glycosidically bound components related to cashew applie (Anacardium occidentale L. Var. nanum) volatiles, J. Agric. Food Chem., 2000, 48, 4, 1167-1174, https://doi.org/10.1021/jf9909252 . [all data]

Mallavarapu, Kulkarni, et al., 1999
Mallavarapu, G.R.; Kulkarni, R.N.; Baskaran, K.; Rao, L.; Ramesh, S., Influence of plant growth stage on the essential oil content and composition in Davana (Artemisia pallens Wall.), J. Agric. Food Chem., 1999, 47, 1, 254-258, https://doi.org/10.1021/jf980624c . [all data]

Saglam, Gozler, et al., 2001
Saglam, H.; Gozler, T.; Kivcak, B.; Demirci, B.; Baser, K.H.C., Volatile compounds from Haplophyllum myrtifolium, Chem. Nat. Compd. (Engl. Transl.), 2001, 37, 5, 442-444, https://doi.org/10.1023/A:1014467225815 . [all data]