3,3-Dichloro-1,1,1-trifluoropropane

Gas phase thermochemistry data

Data compiled by: Hussein Y. Afeefy, Joel F. Liebman, and Stephen E. Stein

Quantity Value Units Method Reference Comment
Δfgas-803.5 ± 4.4kJ/molCcrKolesov, Slavutskaya, et al., 1972Reanalyzed by Pedley, Naylor, et al., 1986, Original value = -791.2 ± 4.2 kJ/mol; hf298_gas[kcal/mol]=-189.15±1.0; Kolesov and Kozina, 1986

Condensed phase thermochemistry data

Data compiled as indicated in comments:
ALS - Hussein Y. Afeefy, Joel F. Liebman, and Stephen E. Stein
DH - Eugene S. Domalski and Elizabeth D. Hearing

Quantity Value Units Method Reference Comment
Δfliquid-837.4 ± 1.3kJ/molCcrKolesov, Slavutskaya, et al., 1972Reanalyzed by Pedley, Naylor, et al., 1986, Original value = -827.6 ± 4.2 kJ/mol; hf298_gas[kcal/mol]=-189.15±1.0; Kolesov and Kozina, 1986; ALS
Quantity Value Units Method Reference Comment
Δcliquid-1357.3 ± 1.3kJ/molCcrKolesov, Slavutskaya, et al., 1972hf298_gas[kcal/mol]=-189.15±1.0; Kolesov and Kozina, 1986; ALS
Quantity Value Units Method Reference Comment
liquid295.06J/mol*KN/AKolesov and Vorob'ev, 1972DH

Constant pressure heat capacity of liquid

Cp,liquid (J/mol*K) Temperature (K) Reference Comment
191.29298.15Kolesov and Vorob'ev, 1972T = 12 to 300 K.; DH

References

Kolesov, Slavutskaya, et al., 1972
Kolesov, V.P.; Slavutskaya, G.M.; Stel'nikova, L.N., Standard enthalpy of formation of 1,1-dichloro-3,3,3-trifluoropropane, Russ. J. Phys. Chem. (Engl. Transl.), 1972, 46, 467-468. [all data]

Pedley, Naylor, et al., 1986
Pedley, J.B.; Naylor, R.D.; Kirby, S.P., Thermochemical Data of Organic Compounds, Chapman and Hall, New York, 1986, 1-792. [all data]

Kolesov and Kozina, 1986
Kolesov, V.P.; Kozina, M.P., Thermochemistry of organic and organohalogen compounds, Russ. Chem. Rev., 1986, 55, 912. [all data]

Kolesov and Vorob'ev, 1972
Kolesov, V.P.; Vorob'ev, V.N., Specific heat in the interval 12-300K and phase changes for some chlorinated 1,1,1-trifluoropropanes, Dokl. Akad. Nauk, 1972, SSSR 203, 116-119. [all data]