p-Bromofluorobenzene

Kovats' RI, non-polar column, custom temperature program

Data compiled by: NIST Mass Spectrometry Data Center, William E. Wallace, director

Column type Packed
Active phase Apiezon M
Column length (m) 2.
Carrier gas
Substrate Chromosorb W
Column diameter (mm)
Phase thickness (μm)
Program not specified
I 940.9
ReferenceJalali-Heravi and Garkani-Nejad, 1993
Comment MSDC-RI

Phase change data

Data compiled by: Robert L. Brown and Stephen E. Stein

Quantity Value Units Method Reference Comment
Tboil423.2KN/AAldrich Chemical Company Inc., 1990
Tboil424. - 425.KN/APCR Inc., 1990

Gas phase ion energetics data

Data compiled as indicated in comments:
LLK - Sharon G. Lias, Rhoda D. Levin, and Sherif A. Kafafi
RDSH - Henry M. Rosenstock, Keith Draxl, Bruce W. Steiner, and John T. Herron

Ionization energy determinations

IE (eV) Method Reference Comment
9.02 ± 0.02PEMohraz, Maier, et al., 1980LLK
8.99 ± 0.03PIWatanabe, Nakayama, et al., 1962RDSH
9.03PEGounelle, Jullien, et al., 1975Vertical value; LLK

References

Jalali-Heravi and Garkani-Nejad, 1993
Jalali-Heravi, M.; Garkani-Nejad, Z., Prediction of gas chromatographic retention indices of some benzene derivatives, J. Chromatogr., 1993, 648, 2, 389-393, https://doi.org/10.1016/0021-9673(93)80421-4 . [all data]