Coniferyl aldehyde

Van Den Dool and Kratz RI, non-polar column, custom temperature program

View large format table.

Column type Active phase I Reference Comment
CapillaryVF-5MS1751.8Tret'yakov, 200830. m/0.25 mm/0.25 μm, He; Program: Multi-step temperature program; T(initial)=60C; T(final)=270C

Van Den Dool and Kratz RI, polar column, custom temperature program

View large format table.

Column type Active phase I Reference Comment
CapillaryStabilwax3038.Natali N., Chinnici F., et al., 200630. m/0.25 mm/0.25 μm, He; Program: 40C => 3C/min => 100C => 5C/min => 240C(10min)

Normal alkane RI, non-polar column, temperature ramp

View large format table.

Column type Active phase I Reference Comment
CapillaryOV-11672.Da Costa, Yang, et al., 201050. m/0.32 mm/0.50 μm, 2. K/min, 270. C @ 10. min; Tstart: 40. C
CapillaryHP-11676.Castel, Fernandez, et al., 200650. m/0.2 mm/0.5 μm, He, 2. K/min, 250. C @ 120. min; Tstart: 60. C

Normal alkane RI, non-polar column, custom temperature program

View large format table.

Column type Active phase I Reference Comment
CapillaryHP-5MS1741.Alissandrakis, Kibaris, et al., 200530. m/0.25 mm/0.25 μm, He; Program: 40C(3min) => 2C/min => 180C => 10C/min => 250C(5min)

References

Tret'yakov, 2008
Tret'yakov, K.V., Retention Data. NIST Mass Spectrometry Data Center., NIST Mass Spectrometry Data Center, 2008. [all data]

Natali N., Chinnici F., et al., 2006
Natali N.; Chinnici F.; Riponi C., Characterization of volatiles in extracts from oak chips obtained by accelerated solvent extraction (ASE), J. Agric. Food Chem., 2006, 54, 21, 8190-8198, https://doi.org/10.1021/jf0614387 . [all data]

Da Costa, Yang, et al., 2010
Da Costa, N.C.; Yang, Y.; Kowalczyk, J.; Poulsen, M.L., The analysis of volatiles and non-volatiles in Yerba Mate tea (Ilex paraguariensis) in Proc. 12th Weurman Symp., Blank, I.; Wust, M.; Yeretzian, C., ed(s)., Institut fur Chemie und Biologisher Chemie, Wissenschafen, Winterthur, 2010, 494-497. [all data]

Castel, Fernandez, et al., 2006
Castel, C.; Fernandez, X.; Lizzani-Cuvelier, L.; Perichet, C.; Lavoine, S., Characterization of the Chemical Composition of a Byproduct from Siam Benzoin Gum, J. Agric. Food Chem., 2006, 54, 23, 8848-8854, https://doi.org/10.1021/jf061193y . [all data]

Alissandrakis, Kibaris, et al., 2005
Alissandrakis, E.; Kibaris, A.C.; Tarantilis, P.A.; Harizanis, P.C.; Polissiou, M., Flavour compounds of Greek cotton honey, J. Sci. Food Agric., 2005, 85, 9, 1444-1452, https://doi.org/10.1002/jsfa.2124 . [all data]