C7H6F3NO2S

Reaction thermochemistry data

Data compiled by: John E. Bartmess

Individual Reactions

C7H5F3NO2S- + Hydrogen cation = C7H6F3NO2S

By formula: C7H5F3NO2S- + H+ = C7H6F3NO2S

Quantity Value Units Method Reference Comment
Δr1312. ± 8.4kJ/molIMREKoppel, Taft, et al., 1994gas phase

References

Koppel, Taft, et al., 1994
Koppel, I.A.; Taft, R.W.; Anvia, F.; Zhu, S.Z.; Hu, L.Q.; Sung, K.S.; Desmarteau, D.D.; Yagupolskii, L.M., The Gas-Phase Acidities of Very Strong Neutral Bronsted Acids, J. Am. Chem. Soc., 1994, 116, 7, 3047, https://doi.org/10.1021/ja00086a038 . [all data]