1-Azabicyclo[2.2.2]octane, 4-methyl-

Gas phase ion energetics data

Data evaluated as indicated in comments:
HL - Edward P. Hunter and Sharon G. Lias

Data compiled as indicated in comments:
LLK - Sharon G. Lias, Rhoda D. Levin, and Sherif A. Kafafi

Quantity Value Units Method Reference Comment
Proton affinity (review)979.4kJ/molN/AHunter and Lias, 1998HL
Quantity Value Units Method Reference Comment
Gas basicity948.6kJ/molN/AHunter and Lias, 1998HL

Ionization energy determinations

IE (eV) Method Reference Comment
8.06 ± 0.015PEBieri and Heilbronner, 1974Vertical value; LLK

References

Hunter and Lias, 1998
Hunter, E.P.; Lias, S.G., Evaluated Gas Phase Basicities and Proton Affinities of Molecules: An Update, J. Phys. Chem. Ref. Data, 1998, 27, 3, 413-656, https://doi.org/10.1063/1.556018 . [all data]

Bieri and Heilbronner, 1974
Bieri, G.; Heilbronner, E., Der einfluss von substituenten in stellung 4 auf das n-ionisations- zpotenial des chinuclidins, Helv. Chim. Acta, 1974, 57, 546. [all data]