Benzene, 1-(chloromethyl)-3-fluoro-

Van Den Dool and Kratz RI, non-polar column, temperature ramp

Data compiled by: NIST Mass Spectrometry Data Center, William E. Wallace, director

Column type CapillaryCapillary
Active phase OV-1OV-1
Column length (m)
Carrier gas
Substrate
Column diameter (mm)
Phase thickness (μm)
Tstart (C) 35.35.
Tend (C) 300.300.
Heat rate (K/min) 8.8.
Initial hold (min)
Final hold (min)
I 987.1987.1
ReferenceGautzsch and Zinn, 1996Gautzsch and Zinn, 1996
Comment MSDC-RI MSDC-RI

References

Gautzsch and Zinn, 1996
Gautzsch, R.; Zinn, P., Use of incremental models to estimate the retention indexes of aromatic compounds, Chromatographia, 1996, 43, 3/4, 163-176, https://doi.org/10.1007/BF02292946 . [all data]