Alpha-amino-d2-toluene

Gas phase ion energetics data

Data compiled by: Henry M. Rosenstock, Keith Draxl, Bruce W. Steiner, and John T. Herron

Appearance energy determinations

Ion AE (eV) Other Products MethodReferenceComment
CH2D2N+11.0 ± 0.1?PIAkopyan and Vilesov, 1964
C5H2D2N+11.0 ± 0.2?PIAkopyan and Vilesov, 1964
C7H7+11.7 ± 0.1ND2PIAkopyan and Vilesov, 1964

References

Akopyan and Vilesov, 1964
Akopyan, M.E.; Vilesov, F.I., Excited states of positive ions and dissociative photoionization of aromatic amines, Dokl. Akad. Nauk SSSR, 1964, 158, 1386, In original 965. [all data]