3-Buten-2-one, 1,1,1-trifluoro-4-mercapto-4-(2-thienyl)-

Gas phase thermochemistry data

Data compiled by: Hussein Y. Afeefy, Joel F. Liebman, and Stephen E. Stein

Quantity Value Units Method Reference Comment
Δfgas-630.3 ± 5.4kJ/molCcrRibeiro da Silva, Santos, et al., 1997

Condensed phase thermochemistry data

Data compiled by: Hussein Y. Afeefy, Joel F. Liebman, and Stephen E. Stein

Quantity Value Units Method Reference Comment
Δfsolid-725.4 ± 3.9kJ/molCcrRibeiro da Silva, Santos, et al., 1997

Phase change data

Data compiled as indicated in comments:
ALS - Hussein Y. Afeefy, Joel F. Liebman, and Stephen E. Stein
AC - William E. Acree, Jr., James S. Chickos

Quantity Value Units Method Reference Comment
Δsub95.1 ± 3.7kJ/molCRibeiro da Silva, Santos, et al., 1997ALS
Δsub95.1 ± 3.7kJ/molCRibeiro da Silva, Santos, et al., 1997AC

References

Ribeiro da Silva, Santos, et al., 1997
Ribeiro da Silva, M.A.V.; Santos, L.M.N.B.F.; Pilcher, G., Standard enthalpies of formation of 2-thenoyltrifluoroacetone and monothio-2-thenoyltrifluoroacetone by rotating-bomb calorimetry, J. Chem. Thermodyn., 1997, 29, 757-764. [all data]