Benzeneethanol, 3-(trifluoromethyl)-

Phase change data

Data compiled by: Robert L. Brown and Stephen E. Stein

Reduced pressure boiling point

Tboil (K) Pressure (bar) Reference
375.20.016Aldrich Chemical Company Inc., 1990

Normal alkane RI, non-polar column, temperature ramp

View large format table.

Column type Active phase I Reference Comment
CapillaryOV-1011151.Zenkevich, Eliseenkov, et al., 2006Nitrogen, 6. K/min, 240. C @ 10. min; Column length: 25. m; Column diameter: 0.20 mm; Tstart: 60. C

References

Aldrich Chemical Company Inc., 1990
Aldrich Chemical Company Inc., Catalog Handbook of Fine Chemicals, Aldrich Chemical Company, Inc., Milwaukee WI, 1990, 1. [all data]

Zenkevich, Eliseenkov, et al., 2006
Zenkevich, I.G.; Eliseenkov, E.V.; Kasatochkin, A.N., Application of Retention Indices in GC-MS Identification of Halogenated Organic Compounds, Mass Spectromery (Rus.), 2006, 3, 2, 131-140. [all data]