Cyclobutyl radical

Gas phase ion energetics data

Data compiled as indicated in comments:
LBLHLM - Sharon G. Lias, John E. Bartmess, Joel F. Liebman, John L. Holmes, Rhoda D. Levin, and W. Gary Mallard
B - John E. Bartmess

Electron affinity determinations

EA (eV) Method Reference Comment
-0.317 ± 0.097D-EADePuy, Gronert, et al., 1989B

Ionization energy determinations

IE (eV) Method Reference Comment
7.54 ± 0.02PESchultz, Houle, et al., 1984LBLHLM
7.66 ± 0.02PESchultz, Houle, et al., 1984Vertical value; LBLHLM

References

DePuy, Gronert, et al., 1989
DePuy, C.H.; Gronert, S.; Barlow, S.E.; Bierbaum, V.M.; Damrauer, R., The Gas Phase Acidities of the Alkanes, J. Am. Chem. Soc., 1989, 111, 6, 1968, https://doi.org/10.1021/ja00188a003 . [all data]

Schultz, Houle, et al., 1984
Schultz, J.C.; Houle, F.A.; Beauchamp, J.L., Photoelectron spectroscopy of isomeric C4H7 radicals. Implications for the thermochemistry and structures of the radicals and their corresponding carbonium ions, J. Am. Chem. Soc., 1984, 106, 7336. [all data]