Benzene, (1-butylhexyl)-

Van Den Dool and Kratz RI, non-polar column, temperature ramp

Data compiled by: NIST Mass Spectrometry Data Center, William E. Wallace, director

Column type Capillary
Active phase DB-1
Column length (m) 30.
Carrier gas
Substrate
Column diameter (mm) 0.32
Phase thickness (μm) 1.5
Tstart (C) 40.
Tend (C) 280.
Heat rate (K/min) 8.
Initial hold (min) 4.
Final hold (min)
I 1526.
ReferencePeng, Hua, et al., 1992
Comment MSDC-RI

Normal alkane RI, polar column, custom temperature program

Data compiled by: NIST Mass Spectrometry Data Center, William E. Wallace, director

Column type Capillary
Active phase DB-Wax
Column length (m) 30.
Carrier gas
Substrate
Column diameter (mm) 0.53
Phase thickness (μm) 1.0
Program 40 0C (4 min) 4 0C/min -> 200 0C (20 min)
I 1729.
ReferencePeng, 1996
Comment MSDC-RI

References

Peng, Hua, et al., 1992
Peng, C.T.; Hua, R.L.; Maltby, D., Prediction of retention indexes. IV. Chain branching in alkylbenzene isomers with C10-13 alkyl chains identified in a scintillator solvent, J. Chromatogr., 1992, 589, 1-2, 231-239, https://doi.org/10.1016/0021-9673(92)80027-R . [all data]