TiGe16 radical

Gas phase ion energetics data

Data compiled by: John E. Bartmess

Electron affinity determinations

EA (eV) Method Reference Comment
2.010 ± 0.050LPESAtobe, Koyasu, et al., 2012
1.960 ± 0.010LPESFuruse, Koyasu, et al., 2008Vertical Detachment Energy: 2.33±0.01 eV

References

Atobe, Koyasu, et al., 2012
Atobe, J.; Koyasu, K.; Furuse, S.; Nakajima, A., Anion photoelectron spectroscopy of germanium and tin clusters containing a transition-or lanthanide-metal atom; MGen- (n=8-20) and MSnn- (n=15-17) (M = Sc-V, Y-Nb, and Lu-Ta), Phys. Chem. Chem. Phys., 2012, 14, 26, 9403-9410, https://doi.org/10.1039/c2cp23247b . [all data]

Furuse, Koyasu, et al., 2008
Furuse, S.; Koyasu, K.; Atobe, J.; Nakajima, A., Experimental and theoretical characterization of MSi16-, MGe16-, MSn16-, and MPb16- (M = Ti, Zr, and Hf): The role of cage aromaticity, J. Chem. Phys., 2008, 129, 6, 064311, https://doi.org/10.1063/1.2966005 . [all data]