Benzenenethanamine, N,N,2-trimethyl-

Reaction thermochemistry data

Data compiled by: Hussein Y. Afeefy, Joel F. Liebman, and Stephen E. Stein

Individual Reactions

Benzyltrimethylammonium bromide = Hydrogen bromide + C10H15N

By formula: C10H16N.Br = HBr + C10H15N

Quantity Value Units Method Reference Comment
Δr-88. ± 4.kJ/molCmArnett and Wernett, 1993liquid phase; solvent: DMSO

References

Arnett and Wernett, 1993
Arnett, E.M.; Wernett, P.C., Energetics of P, S, and N ylide formation and reaction in solution, J. Org. Chem., 1993, 58, 301-303. [all data]