1,4-Dioxane-2,5-dione, 3,6-dimethyl-, (3S-cis)-

Phase change data

Data compiled by: William E. Acree, Jr., James S. Chickos

Enthalpy of fusion

ΔfusH (kJ/mol) Temperature (K) Reference
16.94366.6Lebedev, Kulagina, et al., 1999

References

Lebedev, Kulagina, et al., 1999
Lebedev, B.V.; Kulagina, T.G.; Kiparisova, E.G., Thermodynamic properties of L-lactide in the temperature range 0-430 K, Zh. Fiz. Khim., 1999, 73, 4, 609. [all data]