2,7,12,17-Tetraethyl-3,8,13,18-tetramethyl-21H,23H-porphin

Condensed phase thermochemistry data

Data compiled by: Hussein Y. Afeefy, Joel F. Liebman, and Stephen E. Stein

Quantity Value Units Method Reference Comment
Δcsolid-17998. ± 18.kJ/molCcbStern and Klebs, 1933Reanalyzed by Cox and Pilcher, 1970, Original value = -18008. kJ/mol; Heat of combustion at 288 K

Gas phase ion energetics data

Data compiled by: Sharon G. Lias, Rhoda D. Levin, and Sherif A. Kafafi

Ionization energy determinations

IE (eV) Method Reference Comment
6.3PEDupuis, Roberge, et al., 1980Vertical value

References

Stern and Klebs, 1933
Stern, A.; Klebs, G., Calorimetrische bestimmungen bei mehrkernigen pyrrolderivaten. IV. 1. Experimentelle daten fur einige porphyrine, chlorine, phaophorbide and purpurine, Ann. Chim., 1933, 505, 295-306. [all data]

Cox and Pilcher, 1970
Cox, J.D.; Pilcher, G., Thermochemistry of Organic and Organometallic Compounds, Academic Press, New York, 1970, 1-636. [all data]

Dupuis, Roberge, et al., 1980
Dupuis, P.; Roberge, R.; Sandorfy, C., The very low ionization potentials of porphyrins and the possible role of rydberg states in photosynthesis, Chem. Phys. Lett., 1980, 75, 434. [all data]