3-Heptene, 4-propyl-

Phase change data

Data compiled by: William E. Acree, Jr., James S. Chickos

Enthalpy of vaporization

ΔvapH (kcal/mol) Temperature (K) Method Reference Comment
10.4348.A,MGStephenson and Malanowski, 1987Based on data from 333. - 371. K. See also Schiessler and Whitmore, 1955.

References

Stephenson and Malanowski, 1987
Stephenson, Richard M.; Malanowski, Stanislaw, Handbook of the Thermodynamics of Organic Compounds, 1987, https://doi.org/10.1007/978-94-009-3173-2 . [all data]

Schiessler and Whitmore, 1955
Schiessler, R.W.; Whitmore, F.C., Properties of High Molecular Weight Hydrocarbons, Ind. Eng. Chem., 1955, 47, 8, 1660-1665, https://doi.org/10.1021/ie50548a054 . [all data]