CI3

Vibrational and/or electronic energy levels

Data compiled by: Marilyn E. Jacox

State:   X

Vib.
sym.
 No.   Approximate
 type of mode
 cm-1   Med.   Method   References

e 3 CI stretch 693 Ar IR Smith and Andrews, 1972

Additional references: Jacox, 1994, page 218

References

Smith and Andrews, 1972
Smith, D.W.; Andrews, L., Matrix infrared spectra and bonding in the di- and triiodomethyl radicals, J. Phys. Chem., 1972, 76, 19, 2718, https://doi.org/10.1021/j100663a016 . [all data]

Jacox, 1994
Jacox, M.E., Vibrational and electronic energy levels of polyatomic transient molecules, American Chemical Society, Washington, DC, 1994, 464. [all data]