Oxirane, 2,3-diethyl-

Condensed phase thermochemistry data

Data compiled by: Hussein Y. Afeefy, Joel F. Liebman, and Stephen E. Stein

Quantity Value Units Method Reference Comment
Δcliquid-912.6kcal/molCcbZubow and Swietoslawski, 1925Corresponding Δfliquid = -61.6 kcal/mol (simple calculation by NIST; no Washburn corrections)

Phase change data

Data compiled by: Thermodynamics Research Center, NIST Boulder Laboratories, Chris Muzny director

Quantity Value Units Method Reference Comment
Tboil379.KN/ASpiegler and Tinker, 1939Uncertainty assigned by TRC = 2.5 K

In addition to the Thermodynamics Research Center (TRC) data available from this site, much more physical and chemical property data is available from the following TRC products:

Van Den Dool and Kratz RI, non-polar column, custom temperature program

Data compiled by: NIST Mass Spectrometry Data Center, William E. Wallace, director

Column type Capillary
Active phase CP-Sil 8CB-MS
Column length (m) 60.
Carrier gas He
Substrate
Column diameter (mm) 0.25
Phase thickness (μm) 0.25
Program 0C(5min) => 40C/min => 40C (2min) => 4C/min => 280C
I 751.
ReferenceElmore, Mottram, et al., 2000
Comment MSDC-RI

References

Zubow and Swietoslawski, 1925
Zubow, P.W.; Swietoslawski, W., No. 21. - Sur la chaleur de combustion de trois oxydes(α), Bull. Soc. Chim. Fr., 1925, 37, 271-274. [all data]

Spiegler and Tinker, 1939
Spiegler, L.; Tinker, J.M., Reactions of 3-Hexene I. Reactions with H2SO4, Halogens and Halogen Acids, J. Am. Chem. Soc., 1939, 61, 940. [all data]